{"text_format":"1","workbook":"xlsx","n_sheets":7,"sheets":["Datos","TD","Menu","MALARIA","BARTONELOSIS","LEISHMANIA","OTROS"],"not_rendered":{"charts":0,"images":34,"macros":1,"external_links":0,"defined_names":35,"comments":0,"pivot_tables":4},"unopened":[],"bounds":{"document_bytes":16777216,"sheet_cells":100000,"rows_first":2000,"rows_last":500,"rows_between":2000,"halvings":0,"cell_chars":16384,"cell_head_chars":4096},"cells_cut":0,"cells_raw":0,"read":"whole","date_system":"1900"}

{"sheet":"Datos","index":0,"n_rows":438,"n_cols":36,"rows_kept":438,"cut":false,"hidden":true,"merged":[]}
[]
[]
[]
[]
[]
[]
[]
[]
[null,"ANO",null,"MESES",null,"COD_RED","DESC_RED","RED",null,"COD_RED","COD_MIC","DESC_MICRO","MICROREDES",null,"COD_ESTAB","DESC_ESTAB","COD_RED","COD_MIC","COD_PROV","COD_DIST","REDMIC","CONCATENAR",null,"COD_PROV","DESC_PROV","CONCATENAR",null,"COD_PROV","COD_DIST","DESC_DIST","PROVDIST","CONCATENAR",null,"UE"]
[null,2024,null,"01-Enero",null,"01","CUSCO SUR",{"$f":"CONCATENATE(F10,\" - \",G10)","v":"01 - CUSCO SUR"},null,"00","00","NO PERTENECE A NINGUNA MICRORED                                                                     ",{"$f":"CONCATENATE(J10,K10,\" - \",L10)","v":"0000 - NO PERTENECE A NINGUNA MICRORED                                                                     "},null,"000000000","(All)","07","00",null,null,{"$f":"CONCATENATE(Q10,R10)","v":"0700"},{"$f":"CONCATENATE(O10,\" - \",P10)","v":"000000000 - (All)"},null,"00","(All)",{"$f":"CONCATENATE(X10,\" - \",Y10)","v":"00 - (All)"},null,"01","00","(All)",{"$f":"CONCATENATE(AB10,AC10)","v":"0100"},{"$f":"CONCATENATE(AB10,AC10,\" - \",AD10)","v":"0100 - (All)"},null,"COD_RED","DESC_RED","CONCATENAR"]
[null,null,null,"02-Febrero",null,"02","CUSCO NORTE","02 - CUSCO NORTE",null,"00","99","(All)","0099 - (All)",null,"000002289","HOSPITAL REGIONAL CUSCO","07","00","01","01",{"$f":"CONCATENATE(Q11,R11)","v":"0700"},{"$f":"CONCATENATE(O11,\" - \",P11)","v":"000002289 - HOSPITAL REGIONAL CUSCO"},null,"01","CUSCO","01 - CUSCO",null,"01","01","CUSCO","0101","0101 - CUSCO",null,1129,"UE - SALUD CANAS - CANCHIS - ESPINAR",{"$f":"CONCATENATE(AH11,\" - \",AI11)","v":"1129 - UE - SALUD CANAS - CANCHIS - ESPINAR"}]
[null,null,null,"03-Marzo",null,"03","LA CONVENCION","03 - LA CONVENCION",null,"01","00","HOSPITAL","0100 - HOSPITAL",null,"000002305","HOSPITAL ANTONIO LORENA","07","00","01","06",{"$f":"CONCATENATE(Q12,R12)","v":"0700"},"000002305 - HOSPITAL ANTONIO LORENA",null,"02","ACOMAYO","02 - ACOMAYO",null,"01","02","CCORCA","0102","0102 - CCORCA",null,1130,"UE - HOSPITAL REGIONAL CUSCO","1130 - UE - HOSPITAL REGIONAL CUSCO"]
[null,null,null,"04-Abril",null,"04","CANAS-CANCHIS-ESPINAR","04 - CANAS-CANCHIS-ESPINAR",null,"01","03","PARURO                                                                                              ","0103 - PARURO                                                                                              ",null,"999999999","(All)","07","99",null,null,{"$f":"CONCATENATE(Q13,R13)","v":"0799"},"999999999 - (All)",null,"03","ANTA","03 - ANTA",null,"01","03","POROY","0103","0103 - POROY",null,1169,"UE - HOSPITAL ANTONIO LORENA","1169 - UE - HOSPITAL ANTONIO LORENA"]
[null,null,null,"05-Mayo",null,"05","KIMBIRI PICHARI","05 - KIMBIRI PICHARI",null,"01","06","PAUCARTAMBO                                                                                         ","0106 - PAUCARTAMBO                                                                                         ",null,"000025210","TUPAC AMARU","01","00","01","05","0100","000025210 - TUPAC AMARU",null,"04","CALCA","04 - CALCA",null,"01","04","SAN JERONIMO","0104","0104 - SAN JERONIMO",null,1170,"UE - SALUD LA CONVENCION","1170 - UE - SALUD LA CONVENCION"]
[null,null,null,"06-Junio",null,"06","CHUMBIVILCAS","06 - CHUMBIVILCAS",null,"01","12","URCOS                                                                                               ","0112 - URCOS                                                                                               ",null,"000000000","(All)","01","16",null,null,{"$f":"CONCATENATE(Q15,R15)","v":"0116"},{"$f":"CONCATENATE(O15,\" - \",P15)","v":"000000000 - (All)"},null,"05","CANAS","05 - CANAS",null,"01","05","SAN SEBASTIAN","0105","0105 - SAN SEBASTIAN",null,1322,"UE - SALUD CUSCO SUR","1322 - UE - SALUD CUSCO SUR"]
[null,null,null,"07-Julio",null,"07","HOSPITALES III","07 - HOSPITALES III",null,"01","13","ACOMAYO                                                                                             ","0113 - ACOMAYO                                                                                             ",null,"000002300","SAN JERONIMO                                                                                        ","01","16","01","04","0116","000002300 - SAN JERONIMO                                                                                        ",null,"06","CANCHIS","06 - CANCHIS",null,"01","06","SANTIAGO","0106","0106 - SANTIAGO",null,1347,"UE - SALUD KIMBIRI PICHARI","1347 - UE - SALUD KIMBIRI PICHARI"]
[null,null,null,"08-Agosto",null,"99","(All)","99 - (All)",null,"01","15","OCONGATE                                                                                            ","0115 - OCONGATE                                                                                            ",null,"000002301","SAN SEBASTIAN                                                                                       ","01","16","01","05","0116","000002301 - SAN SEBASTIAN                                                                                       ",null,"07","CHUMBIVILCAS","07 - CHUMBIVILCAS",null,"01","07","SAYLLA","0107","0107 - SAYLLA",null,1348,"UE - SALUD CUSCO NORTE","1348 - UE - SALUD CUSCO NORTE"]
[null,null,null,"09-Setiembre",null,null,null,null,null,"01","16","CUSCO","0116 - CUSCO",null,"000002303","SANTA ROSA                                                                                          ","01","16","01","05","0116","000002303 - SANTA ROSA                                                                                          ",null,"08","ESPINAR","08 - ESPINAR",null,"01","08","WANCHAQ","0108","0108 - WANCHAQ",null,1547,"UE - HOSPITAL DE ESPINAR","1547 - UE - HOSPITAL DE ESPINAR"]
[null,null,null,"10-Octubre",null,null,null,null,null,"01","99","(All)","0199 - (All)",null,"000002314","SAYLLA                                                                                              ","01","16","01","07","0116","000002314 - SAYLLA                                                                                              ",null,"09","LA CONVENCION","09 - LA CONVENCION",null,"02","00","(All)","0200","0200 - (All)",null,1625,"UE - HOSPITAL SICUANI","1625 - UE - HOSPITAL SICUANI"]
[null,null,null,"11-Noviembre",null,null,null,null,null,"02","01","BELEMPAMPA                                                                                          ","0201 - BELEMPAMPA                                                                                          ",null,"000002323","RONDOCAN                                                                                            ","01","16","02","06","0116","000002323 - RONDOCAN                                                                                            ",null,"10","PARURO","10 - PARURO",null,"02","01","ACOMAYO","0201","0201 - ACOMAYO",null,1626,"UE - HOSPITAL QUILLABAMBA","1626 - UE - HOSPITAL QUILLABAMBA"]
[null,null,null,"12-Diciembre",null,null,null,null,null,"02","02","WANCHAQ                                                                                             ","0202 - WANCHAQ                                                                                             ",null,"000007699","CONCHACALLE                                                                                         ","01","16","01","04","0116","000007699 - CONCHACALLE                                                                                         ",null,"11","PAUCARTAMBO","11 - PAUCARTAMBO",null,"02","02","ACOPIA","0202","0202 - ACOPIA",null,1666,"UE - SALUD CHUMBIVILCAS","1666 - UE - SALUD CHUMBIVILCAS"]
[null,null,null,null,null,null,null,null,null,"02","03","ANTA                                                                                                ","0203 - ANTA                                                                                                ",null,"000010065","ESSALUD-SAN SEBASTIAN","01","16","01","05","0116","000010065 - ESSALUD-SAN SEBASTIAN",null,"12","QUISPICANCHI","12 - QUISPICANCHI",null,"02","03","ACOS","0203","0203 - ACOS",null,"7777","(All)","7777 - (All)"]
[null,null,null,null,null,null,null,null,null,"02","04","LIMATAMBO                                                                                           ","0204 - LIMATAMBO                                                                                           ",null,"000011743","SANIDAD-SANTA ROSA PNP","01","16","01","05","0116","000011743 - SANIDAD-SANTA ROSA PNP",null,"13","URUBAMBA","13 - URUBAMBA",null,"02","04","MOSOC LLACTA","0204","0204 - MOSOC LLACTA"]
[null,null,null,null,null,null,null,null,null,"02","05","PISAC                                                                                               ","0205 - PISAC                                                                                               ",null,"000026181","MENTAL SAN SEBASTIAN","01","16","01","05","0116","000026181 - MENTAL SAN SEBASTIAN",null,null,null,null,null,"02","05","POMACANCHI","0205","0205 - POMACANCHI"]
[null,null,null,null,null,null,null,null,null,"02","06","CALCA                                                                                               ","0206 - CALCA                                                                                               ",null,"000030727","PATRÓN SAN SEBASTIAN","01","16","01","04",{"$f":"CONCATENATE(Q25,R25)","v":"0116"},"000030727 - PATRÓN SAN SEBASTIAN",null,null,null,null,null,"02","06","RONDOCAN","0206","0206 - RONDOCAN"]
[null,null,null,null,null,null,null,null,null,"02","07","URUBAMBA                                                                                            ","0207 - URUBAMBA                                                                                            ",null,"000000000","(All)","01","03",null,null,{"$f":"CONCATENATE(Q26,R26)","v":"0103"},"000000000 - (All)",null,null,null,null,null,"02","07","SANGARARA","0207","0207 - SANGARARA"]
[null,null,null,null,null,null,null,null,null,"02","08","YANATILE                                                                                            ","0208 - YANATILE                                                                                            ",null,"000002499","PARURO                                                                                              ","01","03",10,"01","0103","000002499 - PARURO                                                                                              ",null,null,null,null,null,"03","00","(All)","0300","0300 - (All)"]
[null,null,null,null,null,null,null,null,null,"02","09","SIETE CUARTONES                                                                                     ","0209 - SIETE CUARTONES                                                                                     ",null,"000002500","ACCHA                                                                                               ","01","03",10,"02","0103","000002500 - ACCHA                                                                                               ",null,null,null,null,null,"03","01","ANTA","0301","0301 - ANTA"]
[null,null,null,null,null,null,null,null,null,"02","99","(All)","0299 - (All)",null,"000002501","CCAPI                                                                                               ","01","03",10,"03","0103","000002501 - CCAPI                                                                                               ",null,null,null,null,null,"03","02","ANCAHUASI","0302","0302 - ANCAHUASI"]
[null,null,null,null,null,null,null,null,null,"03","00","HOSPITAL","0300 - HOSPITAL",null,"000002502","CCOYABAMBA                                                                                          ","01","03",10,"03","0103","000002502 - CCOYABAMBA                                                                                          ",null,null,null,null,null,"03","03","CACHIMAYO","0303","0303 - CACHIMAYO"]
[null,null,null,null,null,null,null,null,null,"03","01","SANTA ANA                                                                                           ","0301 - SANTA ANA                                                                                           ",null,"000002503","COLCHA                                                                                              ","01","03",10,"04","0103","000002503 - COLCHA                                                                                              ",null,null,null,null,null,"03","04","CHINCHAYPUJIO","0304","0304 - CHINCHAYPUJIO"]
[null,null,null,null,null,null,null,null,null,"03","02","MARANURA                                                                                            ","0302 - MARANURA                                                                                            ",null,"000002504","HUANOQUITE                                                                                          ","01","03",10,"05","0103","000002504 - HUANOQUITE                                                                                          ",null,null,null,null,null,"03","05","HUAROCONDO","0305","0305 - HUAROCONDO"]
[null,null,null,null,null,null,null,null,null,"03","03","QUELLOUNO                                                                                           ","0303 - QUELLOUNO                                                                                           ",null,"000002505","OMACHA                                                                                              ","01","03",10,"06","0103","000002505 - OMACHA                                                                                              ",null,null,null,null,null,"03","06","LIMATAMBO","0306","0306 - LIMATAMBO"]
[null,null,null,null,null,null,null,null,null,"03","04","KITENI                                                                                              ","0304 - KITENI                                                                                              ",null,"000002506","ANTAPALLPA                                                                                          ","01","03",10,"06","0103","000002506 - ANTAPALLPA                                                                                          ",null,null,null,null,null,"03","07","MOLLEPATA","0307","0307 - MOLLEPATA"]
[null,null,null,null,null,null,null,null,null,"03","05","KAMISEA                                                                                             ","0305 - KAMISEA                                                                                             ",null,"000002507","PACCARECTAMBO                                                                                       ","01","03",10,"07","0103","000002507 - PACCARECTAMBO                                                                                       ",null,null,null,null,null,"03","08","PUCYURA","0308","0308 - PUCYURA"]
[null,null,null,null,null,null,null,null,null,"03","06","PUCYURA                                                                                             ","0306 - PUCYURA                                                                                             ",null,"000002509","YAURISQUE                                                                                           ","01","03",10,"09","0103","000002509 - YAURISQUE                                                                                           ",null,null,null,null,null,"03","09","ZURITE","0309","0309 - ZURITE"]
[null,null,null,null,null,null,null,null,null,"03","99","(All)","0399 - (All)",null,"000006978","CCOCHIRIHUAY                                                                                        ","01","03",10,"04","0103","000006978 - CCOCHIRIHUAY                                                                                        ",null,null,null,null,null,"04","00","(All)","0400","0400 - (All)"]
[null,null,null,null,null,null,null,null,null,"04","00","HOSPITAL","0400 - HOSPITAL",null,"000007147","HUASQUILLAY                                                                                         ","01","03",10,"06","0103","000007147 - HUASQUILLAY                                                                                         ",null,null,null,null,null,"04","01","CALCA","0401","0401 - CALCA"]
[null,null,null,null,null,null,null,null,null,"04","01","YANAOCA                                                                                             ","0401 - YANAOCA                                                                                             ",null,"000012924","SAHUA SAHUA                                                                                         ","01","03",10,"06","0103","000012924 - SAHUA SAHUA                                                                                         ",null,null,null,null,null,"04","02","COYA","0402","0402 - COYA"]
[null,null,null,null,null,null,null,null,null,"04","02","EL DESCANSO                                                                                         ","0402 - EL DESCANSO                                                                                         ",null,"000000000","(All)","01","06",null,null,"0106","000000000 - (All)",null,null,null,null,null,"04","03","LAMAY","0403","0403 - LAMAY"]
[null,null,null,null,null,null,null,null,null,"04","03","COMBAPATA                                                                                           ","0403 - COMBAPATA                                                                                           ",null,"000002510","PAUCARTAMBO                                                                                         ","01","06",11,"01","0106","000002510 - PAUCARTAMBO                                                                                         ",null,null,null,null,null,"04","04","LARES","0404","0404 - LARES"]
[null,null,null,null,null,null,null,null,null,"04","04","TECHO OBRERO                                                                                        ","0404 - TECHO OBRERO                                                                                        ",null,"000002511","MOLLOMARCA                                                                                          ","01","06",11,"01","0106","000002511 - MOLLOMARCA                                                                                          ",null,null,null,null,null,"04","05","PISAC",{"$f":"CONCATENATE(AB42,AC42)","v":"0405"},{"$f":"CONCATENATE(AB42,AC42,\" - \",AD42)","v":"0405 - PISAC"}]
[null,null,null,null,null,null,null,null,null,"04","05","PAMPAPHALLA                                                                                         ","0405 - PAMPAPHALLA                                                                                         ",null,"000002512","CAICAY                                                                                              ","01","06",11,"02","0106","000002512 - CAICAY                                                                                              ",null,null,null,null,null,"04","06","SAN SALVADOR","0406","0406 - SAN SALVADOR"]
[null,null,null,null,null,null,null,null,null,"04","06","YAURI                                                                                               ","0406 - YAURI                                                                                               ",null,"000002513","HUASAC                                                                                              ","01","06",11,"02","0106","000002513 - HUASAC                                                                                              ",null,null,null,null,null,"04","07","TARAY","0407","0407 - TARAY"]
[null,null,null,null,null,null,null,null,null,"04","99","(All)","0499 - (All)",null,"000002514","CHALLABAMBA                                                                                         ","01","06",11,"03","0106","000002514 - CHALLABAMBA                                                                                         ",null,null,null,null,null,"04","08","YANATILE","0408","0408 - YANATILE"]
[null,null,null,null,null,null,null,null,null,"05","00","HOSPITAL","0500 - HOSPITAL",null,"000002516","COLQUEPATA                                                                                          ","01","06",11,"04","0106","000002516 - COLQUEPATA                                                                                          ",null,null,null,null,null,"05","00","(All)","0500","0500 - (All)"]
[null,null,null,null,null,null,null,null,null,"05","01","KIMBIRI                                                                                             ","0501 - KIMBIRI                                                                                             ",null,"000002517","PICHIHUA COLQUEPATA                                                                                 ","01","06",11,"04","0106","000002517 - PICHIHUA COLQUEPATA                                                                                 ",null,null,null,null,null,"05","01","YANAOCA","0501","0501 - YANAOCA"]
[null,null,null,null,null,null,null,null,null,"05","02","PICHARI                                                                                             ","0502 - PICHARI                                                                                             ",null,"000002518","VIZCOCHONI                                                                                          ","01","06",11,"04","0106","000002518 - VIZCOCHONI                                                                                          ",null,null,null,null,null,"05","02","CHECCA","0502","0502 - CHECCA"]
[null,null,null,null,null,null,null,null,null,"05","99","(All)","0599 - (All)",null,"000002519","AYRE                                                                                                ","01","06",11,"04","0106","000002519 - AYRE                                                                                                ",null,null,null,null,null,"05","03","KUNTURKANKI","0503","0503 - KUNTURKANKI"]
[null,null,null,null,null,null,null,null,null,"06","00","HOSPITAL","0600 - HOSPITAL",null,"000002520","HUANCARANI                                                                                          ","01","06",11,"05","0106","000002520 - HUANCARANI                                                                                          ",null,null,null,null,null,"05","04","LANGUI","0504","0504 - LANGUI"]
[null,null,null,null,null,null,null,null,null,"06","09","SANTO TOMAS                                                                                         ","0609 - SANTO TOMAS                                                                                         ",null,"000002521","PILCOPATA                                                                                           ","01","06",11,"06","0106","000002521 - PILCOPATA                                                                                           ",null,null,null,null,null,"05","05","LAYO","0505","0505 - LAYO"]
[null,null,null,null,null,null,null,null,null,"06","01","LIVITACA                                                                                            ","0601 - LIVITACA                                                                                            ",null,"000002522","PATRIA                                                                                              ","01","06",11,"06","0106","000002522 - PATRIA                                                                                              ",null,null,null,null,null,"05","06","PAMPAMARCA","0506","0506 - PAMPAMARCA"]
[null,null,null,null,null,null,null,null,null,"06","99","(All)","0699 - (All)",null,"000006979","TOCRA                                                                                               ","01","06",11,"04","0106","000006979 - TOCRA                                                                                               ",null,null,null,null,null,"05","07","QUEHUE","0507","0507 - QUEHUE"]
[null,null,null,null,null,null,null,null,null,"07","00","HOSPITAL","0700 - HOSPITAL",null,"000010077","ESSALUD-PAUCARTAMBO","01","06",11,"01","0106","000010077 - ESSALUD-PAUCARTAMBO",null,null,null,null,null,"05","08","TUPAC AMARU","0508","0508 - TUPAC AMARU"]
[null,null,null,null,null,null,null,null,null,"99","99","(All)","9999 - (All)",null,"000033777","MENTAL COMUNITARIO VIRGEN DEL ROSARIO","01","06",11,"01","0106","000033777 - MENTAL COMUNITARIO VIRGEN DEL ROSARIO",null,null,null,null,null,"06","00","(All)","0600","0600 - (All)"]
[null,null,null,null,null,null,null,null,null,null,null,null,null,null,"000000000","(All)","01","12",null,null,"0112","000000000 - (All)",null,null,null,null,null,"06","01","SICUANI","0601","0601 - SICUANI"]
[null,null,null,null,null,null,null,null,null,null,null,null,null,null,"000002523","URCOS                                                                                               ","01","12",12,"01","0112","000002523 - URCOS                                                                                               ",null,null,null,null,null,"06","02","CHECACUPE","0602","0602 - CHECACUPE"]
[null,null,null,null,null,null,null,null,null,null,null,null,null,null,"000002525","ANDAHUAYLILLAS                                                                                      ","01","12",12,"02","0112","000002525 - ANDAHUAYLILLAS                                                                                      ",null,null,null,null,null,"06","03","COMBAPATA","0603","0603 - COMBAPATA"]
[null,null,null,null,null,null,null,null,null,null,null,null,null,null,"000002530","CUSIPATA                                                                                            ","01","12",12,"06","0112","000002530 - CUSIPATA                                                                                            ",null,null,null,null,null,"06","04","MARANGANI","0604","0604 - MARANGANI"]
[null,null,null,null,null,null,null,null,null,null,null,null,null,null,"000002532","HUARO                                                                                               ","01","12",12,"07","0112","000002532 - HUARO                                                                                               ",null,null,null,null,null,"06","05","PITUMARCA","0605","0605 - PITUMARCA"]
[null,null,null,null,null,null,null,null,null,null,null,null,null,null,"000002533","URPAY                                                                                               ","01","12",12,"07","0112","000002533 - URPAY                                                                                               ",null,null,null,null,null,"06","06","SAN PABLO","0606","0606 - SAN PABLO"]
[null,null,null,null,null,null,null,null,null,null,null,null,null,null,"000002534","LUCRE                                                                                               ","01","12",12,"08","0112","000002534 - LUCRE                                                                                               ",null,null,null,null,null,"06","07","SAN PEDRO","0607","0607 - SAN PEDRO"]
[null,null,null,null,null,null,null,null,null,null,null,null,null,null,"000002537","OROPESA                                                                                             ","01","12",12,11,"0112","000002537 - OROPESA                                                                                             ",null,null,null,null,null,"06","08","TINTA","0608","0608 - TINTA"]
[null,null,null,null,null,null,null,null,null,null,null,null,null,null,"000002538","QUIQUIJANA                                                                                          ","01","12",12,12,"0112","000002538 - QUIQUIJANA                                                                                          ",null,null,null,null,null,"07","00","(All)","0700","0700 - (All)"]
[null,null,null,null,null,null,null,null,null,null,null,null,null,null,"000002539","CCOLCA","01","12",12,12,"0112","000002539 - CCOLCA",null,null,null,null,null,"07","01","SANTO TOMAS","0701","0701 - SANTO TOMAS"]
[null,null,null,null,null,null,null,null,null,null,null,null,null,null,"000006980","CHILLIHUANI                                                                                         ","01","12",12,"06","0112","000006980 - CHILLIHUANI                                                                                         ",null,null,null,null,null,"07","02","CAPACMARCA","0702","0702 - CAPACMARCA"]
[null,null,null,null,null,null,null,null,null,null,null,null,null,null,"000008911","HUARA HUARA                                                                                         ","01","12",12,"05","0112","000008911 - HUARA HUARA                                                                                         ",null,null,null,null,null,"07","03","CHAMACA","0703","0703 - CHAMACA"]
[null,null,null,null,null,null,null,null,null,null,null,null,null,null,"000011747","SANIDAD-PUCUTO PNP","01","12",12,"07","0112","000011747 - SANIDAD-PUCUTO PNP",null,null,null,null,null,"07","04","COLQUEMARCA","0704","0704 - COLQUEMARCA"]
[null,null,null,null,null,null,null,null,null,null,null,null,null,null,"000026385","ESSALUD-URCOS","01","12",12,"01","0112","000026385 - ESSALUD-URCOS",null,null,null,null,null,"07","05","LIVITACA","0705","0705 - LIVITACA"]
[null,null,null,null,null,null,null,null,null,null,null,null,null,null,"000030708","MENTAL COMUNITARIO HUARO","01","12",12,"07","0112","000030708 - MENTAL COMUNITARIO HUARO",null,null,null,null,null,"07","06","LLUSCO","0706","0706 - LLUSCO"]
[null,null,null,null,null,null,null,null,null,null,null,null,null,null,"000000000","(All)","01","13",null,null,"0113","000000000 - (All)",null,null,null,null,null,"07","07","QUIÑOTA","0707","0707 - QUIÑOTA"]
[null,null,null,null,null,null,null,null,null,null,null,null,null,null,"000002317","ACOMAYO                                                                                             ","01","13","02","01","0113","000002317 - ACOMAYO                                                                                             ",null,null,null,null,null,"07","08","VELILLE","0708","0708 - VELILLE"]
[null,null,null,null,null,null,null,null,null,null,null,null,null,null,"000002318","ACOPIA                                                                                              ","01","13","02","02","0113","000002318 - ACOPIA                                                                                              ",null,null,null,null,null,"08","00","(All)","0800","0800 - (All)"]
[null,null,null,null,null,null,null,null,null,null,null,null,null,null,"000002319","ACOS                                                                                                ","01","13","02","03","0113","000002319 - ACOS                                                                                                ",null,null,null,null,null,"08","01","ESPINAR",{"$f":"CONCATENATE(AB74,AC74)","v":"0801"},{"$f":"CONCATENATE(AB74,AC74,\" - \",AD74)","v":"0801 - ESPINAR"}]
[null,null,null,null,null,null,null,null,null,null,null,null,null,null,"000002321","CENTRO DE SALUD POMACANCHI","01","13","02","05","0113",{"$f":"CONCATENATE(O75,\" - \",P75)","v":"000002321 - CENTRO DE SALUD POMACANCHI"},null,null,null,null,null,"08","02","CONDOROMA","0802","0802 - CONDOROMA"]
[null,null,null,null,null,null,null,null,null,null,null,null,null,null,"000002322","SAN JUAN DE POMACANCHI                                                                              ","01","13","02","05","0113","000002322 - SAN JUAN DE POMACANCHI                                                                              ",null,null,null,null,null,"08","03","COPORAQUE","0803","0803 - COPORAQUE"]
[null,null,null,null,null,null,null,null,null,null,null,null,null,null,"000002324","PUESTO DE SALUD SANGARARA","01","13","02","07","0113","000002324 - PUESTO DE SALUD SANGARARA",null,null,null,null,null,"08","04","OCORURO","0804","0804 - OCORURO"]
[null,null,null,null,null,null,null,null,null,null,null,null,null,null,"000002325","PUESTO DE SALUD MARCACONGA","01","13","02","07","0113","000002325 - PUESTO DE SALUD MARCACONGA",null,null,null,null,null,"08","05","PALLPATA","0805","0805 - PALLPATA"]
[null,null,null,null,null,null,null,null,null,null,null,null,null,null,"000002508","PILLPINTO                                                                                           ","01","13",10,"08","0113","000002508 - PILLPINTO                                                                                           ",null,null,null,null,null,"08","06","PICHIGUA","0806","0806 - PICHIGUA"]
[null,null,null,null,null,null,null,null,null,null,null,null,null,null,"000010076","ESSALUD-ACOMAYO","01","13","02","01","0113","000010076 - ESSALUD-ACOMAYO",null,null,null,null,null,"08","07","SUYCKUTAMBO","0807","0807 - SUYCKUTAMBO"]
[null,null,null,null,null,null,null,null,null,null,null,null,null,null,"000012926","SANTA  LUCIA                                                                                        ","01","13","02","05","0113","000012926 - SANTA  LUCIA                                                                                        ",null,null,null,null,null,"08","08","ALTO PICHIGUA","0808","0808 - ALTO PICHIGUA"]
[null,null,null,null,null,null,null,null,null,null,null,null,null,null,"000000000","(All)","01","15",null,null,"0115","000000000 - (All)",null,null,null,null,null,"09","00","(All)","0900","0900 - (All)"]
[null,null,null,null,null,null,null,null,null,null,null,null,null,null,"000002524","PAMPACAMARA                                                                                         ","01","15",12,"05","0115","000002524 - PAMPACAMARA                                                                                         ",null,null,null,null,null,"09","01","SANTA ANA","0901","0901 - SANTA ANA"]
[null,null,null,null,null,null,null,null,null,null,null,null,null,null,"000002526","QUINCE MIL","01","15",12,"03","0115","000002526 - QUINCE MIL",null,null,null,null,null,"09","02","ECHARATE","0902","0902 - ECHARATE"]
[null,null,null,null,null,null,null,null,null,null,null,null,null,null,"000002527","CCARHUAYO","01","15",12,"04","0115","000002527 - CCARHUAYO",null,null,null,null,null,"09","03","HUAYOPATA","0903","0903 - HUAYOPATA"]
[null,null,null,null,null,null,null,null,null,null,null,null,null,null,"000002528","CCATCCA                                                                                             ","01","15",12,"05","0115","000002528 - CCATCCA                                                                                             ",null,null,null,null,null,"09","04","MARANURA","0904","0904 - MARANURA"]
[null,null,null,null,null,null,null,null,null,null,null,null,null,null,"000002529","KCAURY                                                                                              ","01","15",12,"05","0115","000002529 - KCAURY                                                                                              ",null,null,null,null,null,"09","05","OCOBAMBA","0905","0905 - OCOBAMBA"]
[null,null,null,null,null,null,null,null,null,null,null,null,null,null,"000002535","MARCAPATA                                                                                           ","01","15",12,"09","0115","000002535 - MARCAPATA                                                                                           ",null,null,null,null,null,"09","06","QUELLOUNO","0906","0906 - QUELLOUNO"]
[null,null,null,null,null,null,null,null,null,null,null,null,null,null,"000002536","OCONGATE                                                                                            ","01","15",12,10,"0115","000002536 - OCONGATE                                                                                            ",null,null,null,null,null,"09","07","KIMBIRI","0907","0907 - KIMBIRI"]
[null,null,null,null,null,null,null,null,null,null,null,null,null,null,"000006977","TINKI                                                                                               ","01","15",12,10,{"$f":"CONCATENATE(Q90,R90)","v":"0115"},"000006977 - TINKI                                                                                               ",null,null,null,null,null,"09","08","SANTA TERESA","0908","0908 - SANTA TERESA"]
[null,null,null,null,null,null,null,null,null,null,null,null,null,null,"000007110","INCACANCHA                                                                                          ","01","15",12,"09","0115","000007110 - INCACANCHA                                                                                          ",null,null,null,null,null,"09","09","VILCABAMBA","0909","0909 - VILCABAMBA"]
[null,null,null,null,null,null,null,null,null,null,null,null,null,null,"000012931","CHICHINA                                                                                            ","01","15",12,"05","0115","000012931 - CHICHINA                                                                                            ",null,null,null,null,null,"09","10","PICHARI","0910","0910 - PICHARI"]
[null,null,null,null,null,null,null,null,null,null,null,null,null,null,"000016335","CCAPANA                                                                                             ","01","15",12,"05","0115","000016335 - CCAPANA                                                                                             ",null,null,null,null,null,"09","11","INKAWASI                                ","0911","0911 - INKAWASI                                "]
[null,null,null,null,null,null,null,null,null,null,null,null,null,null,"999999999","(All)","01","99",null,null,"0199","999999999 - (All)",null,null,null,null,null,"09","12","VILLA VIRGEN","0912","0912 - VILLA VIRGEN"]
[null,null,null,null,null,null,null,null,null,null,null,null,null,null,"000000000","(All)","02","01",null,null,"0201","000000000 - (All)",null,null,null,null,null,"09","13","VILLA KINTIARINA","0913","0913 - VILLA KINTIARINA"]
[null,null,null,null,null,null,null,null,null,null,null,null,null,null,"000002292","INDEPENDENCIA                                                                                       ","02","01","01","01","0201","000002292 - INDEPENDENCIA                                                                                       ",null,null,null,null,null,"09","14","MEGANTONI","0914","0914 - MEGANTONI"]
[null,null,null,null,null,null,null,null,null,null,null,null,null,null,"000002297","CCORCCA                                                                                             ","02","01","01","02","0201","000002297 - CCORCCA                                                                                             ",null,null,null,null,null,"09","15","KUMPIRUSHIATO","0915","0915 - KUMPIRUSHIATO"]
[null,null,null,null,null,null,null,null,null,null,null,null,null,null,"000002306","BELEMPAMPA                                                                                          ","02","01","01","06","0201","000002306 - BELEMPAMPA                                                                                          ",null,null,null,null,null,"09","16","CIELO PUNCO","0916","0916 - CIELO PUNCO"]
[null,null,null,null,null,null,null,null,null,null,null,null,null,null,"000002308","ZARZUELA ALTA                                                                                       ","02","01","01","06","0201","000002308 - ZARZUELA ALTA                                                                                       ",null,null,null,null,null,"09","17","MANITEA","0917","0917 - MANITEA"]
[null,null,null,null,null,null,null,null,null,null,null,null,null,null,"000002309","DIGNIDAD NACIONAL                                                                                   ","02","01","01","06","0201","000002309 - DIGNIDAD NACIONAL                                                                                   ",null,null,null,null,null,"09","18","UNION ASHANINKA","0918","0918 - UNION ASHANINKA"]
[null,null,null,null,null,null,null,null,null,null,null,null,null,null,"000002313","OCCOPATA                                                                                            ","02","01","01","06","0201","000002313 - OCCOPATA                                                                                            ",null,null,null,null,null,"10","00","(All)","1000","1000 - (All)"]
[null,null,null,null,null,null,null,null,null,null,null,null,null,null,"000010067","ESSALUD-SANTIAGO","02","01","01","06","0201","000010067 - ESSALUD-SANTIAGO",null,null,null,null,null,"10","01","PARURO","1001","1001 - PARURO"]
[null,null,null,null,null,null,null,null,null,null,null,null,null,null,"000010920","EJERCITO-QUINTA BRIGADA DE MONTAÑA","02","01","01","06","0201","000010920 - EJERCITO-QUINTA BRIGADA DE MONTAÑA",null,null,null,null,null,"10","02","ACCHA","1002","1002 - ACCHA"]
[null,null,null,null,null,null,null,null,null,null,null,null,null,null,"000026182","MENTAL SANTIAGO","02","01","01","06","0201","000026182 - MENTAL SANTIAGO",null,null,null,null,null,"10","03","CCAPI","1003","1003 - CCAPI"]
[null,null,null,null,null,null,null,null,null,null,null,null,null,null,"000000000","(All)","02","02",null,null,"0202","000000000 - (All)",null,null,null,null,null,"10","04","COLCHA","1004","1004 - COLCHA"]
[null,null,null,null,null,null,null,null,null,null,null,null,null,null,"000002302","CCORAO                                                                                              ","02","02","01","05","0202","000002302 - CCORAO                                                                                              ",null,null,null,null,null,"10","05","HUANOQUITE",{"$f":"CONCATENATE(AB106,AC106)","v":"1005"},{"$f":"CONCATENATE(AB106,AC106,\" - \",AD106)","v":"1005 - HUANOQUITE"}]
[null,null,null,null,null,null,null,null,null,null,null,null,null,null,"000002307","MANCO CAPAC","02","02","01","06","0202","000002307 - MANCO CAPAC",null,null,null,null,null,"10","06","OMACHA","1006","1006 - OMACHA"]
[null,null,null,null,null,null,null,null,null,null,null,null,null,null,"000002310","CHOCCO                                                                                              ","02","02","01","06","0202","000002310 - CHOCCO                                                                                              ",null,null,null,null,null,"10","07","PACCARITAMBO","1007","1007 - PACCARITAMBO"]
[null,null,null,null,null,null,null,null,null,null,null,null,null,null,"000002315","WANCHAQ                                                                                             ","02","02","01","08","0202","000002315 - WANCHAQ                                                                                             ",null,null,null,null,null,"10","08","PILLPINTO","1008","1008 - PILLPINTO"]
[null,null,null,null,null,null,null,null,null,null,null,null,null,null,"000002316","TTIO                                                                                                ","02","02","01","08","0202","000002316 - TTIO                                                                                                ",null,null,null,null,null,"10","09","YAURISQUE","1009","1009 - YAURISQUE"]
[null,null,null,null,null,null,null,null,null,null,null,null,null,null,"000010041","ESSALUD-ADOLFO GUEVARA V.","02","02","01","08","0202","000010041 - ESSALUD-ADOLFO GUEVARA V.",null,null,null,null,null,"11","00","(All)","1100","1100 - (All)"]
[null,null,null,null,null,null,null,null,null,null,null,null,null,null,"000026183","ESSALUD-METROPOLITANO","02","02","01","08","0202","000026183 - ESSALUD-METROPOLITANO",null,null,null,null,null,"11","01","PAUCARTAMBO","1101","1101 - PAUCARTAMBO"]
[null,null,null,null,null,null,null,null,null,null,null,null,null,null,"000030730","PATRON SANTIAGO","02","02","01","08","0202","000030730 - PATRON SANTIAGO",null,null,null,null,null,"11","02","CAICAY","1102","1102 - CAICAY"]
[null,null,null,null,null,null,null,null,null,null,null,null,null,null,"000034419","MENTAL COMUNITARIO CUSCO","02","02","01","08","0202","000034419 - MENTAL COMUNITARIO CUSCO",null,null,null,null,null,"11","03","CHALLABAMBA","1103","1103 - CHALLABAMBA"]
[null,null,null,null,null,null,null,null,null,null,null,null,null,null,"000000000","(All)","02","03",null,null,"0203","000000000 - (All)",null,null,null,null,null,"11","04","COLQUEPATA","1104","1104 - COLQUEPATA"]
[null,null,null,null,null,null,null,null,null,null,null,null,null,null,"000002326","ANTA                                                                                                ","02","03","03","01","0203","000002326 - ANTA                                                                                                ",null,null,null,null,null,"11","05","HUANCARANI","1105","1105 - HUANCARANI"]
[null,null,null,null,null,null,null,null,null,null,null,null,null,null,"000002327","CHACAN                                                                                              ","02","03","03","01","0203","000002327 - CHACAN                                                                                              ",null,null,null,null,null,"11","06","KOSÑIPATA","1106","1106 - KOSÑIPATA"]
[null,null,null,null,null,null,null,null,null,null,null,null,null,null,"000002328","COMPONE                                                                                             ","02","03","03","01","0203","000002328 - COMPONE                                                                                             ",null,null,null,null,null,"12","00","(All)","1200","1200 - (All)"]
[null,null,null,null,null,null,null,null,null,null,null,null,null,null,"000002329","CONCHACALLA                                                                                         ","02","03","03","01","0203","000002329 - CONCHACALLA                                                                                         ",null,null,null,null,null,"12","01","URCOS","1201","1201 - URCOS"]
[null,null,null,null,null,null,null,null,null,null,null,null,null,null,"000002330","ANCAHUASI                                                                                           ","02","03","03","02","0203","000002330 - ANCAHUASI                                                                                           ",null,null,null,null,null,"12","02","ANDAHUAYLILLAS","1202","1202 - ANDAHUAYLILLAS"]
[null,null,null,null,null,null,null,null,null,null,null,null,null,null,"000002331","CACHIMAYO                                                                                           ","02","03","03","03","0203","000002331 - CACHIMAYO                                                                                           ",null,null,null,null,null,"12","03","CAMANTI","1203","1203 - CAMANTI"]
[null,null,null,null,null,null,null,null,null,null,null,null,null,null,"000002332","CHINCHAYPUJIO                                                                                       ","02","03","03","04","0203","000002332 - CHINCHAYPUJIO                                                                                       ",null,null,null,null,null,"12","04","CCARHUAYO","1204","1204 - CCARHUAYO"]
[null,null,null,null,null,null,null,null,null,null,null,null,null,null,"000002333","HUAROCONDO                                                                                          ","02","03","03","05","0203","000002333 - HUAROCONDO                                                                                          ",null,null,null,null,null,"12","05","CCATCA","1205","1205 - CCATCA"]
[null,null,null,null,null,null,null,null,null,null,null,null,null,null,"000002334","HUAYLLACOCHA                                                                                        ","02","03","03","05","0203","000002334 - HUAYLLACOCHA                                                                                        ",null,null,null,null,null,"12","06","CUSIPATA","1206","1206 - CUSIPATA"]
[null,null,null,null,null,null,null,null,null,null,null,null,null,null,"000002339","PUCYURA ANTA                                                                                        ","02","03","03","08","0203","000002339 - PUCYURA ANTA                                                                                        ",null,null,null,null,null,"12","07","HUARO","1207","1207 - HUARO"]
[null,null,null,null,null,null,null,null,null,null,null,null,null,null,"000002340","ZURITE                                                                                              ","02","03","03","09","0203","000002340 - ZURITE                                                                                              ",null,null,null,null,null,"12","08","LUCRE","1208","1208 - LUCRE"]
[null,null,null,null,null,null,null,null,null,null,null,null,null,null,"000006972","PANTIPATA                                                                                           ","02","03","03","04","0203","000006972 - PANTIPATA                                                                                           ",null,null,null,null,null,"12","09","MARCAPATA","1209","1209 - MARCAPATA"]
[null,null,null,null,null,null,null,null,null,null,null,null,null,null,"000027790","MENTAL COMUNITARIO ANTA","02","03","03","01","0203","000027790 - MENTAL COMUNITARIO ANTA",null,null,null,null,null,"12","10","OCONGATE","1210","1210 - OCONGATE"]
[null,null,null,null,null,null,null,null,null,null,null,null,null,null,"000000000","(All)","02","04",null,null,"0204","000000000 - (All)",null,null,null,null,null,"12","11","OROPESA","1211","1211 - OROPESA"]
[null,null,null,null,null,null,null,null,null,null,null,null,null,null,"000002336","LIMATAMBO                                                                                           ","02","04","03","06","0204","000002336 - LIMATAMBO                                                                                           ",null,null,null,null,null,"12","12","QUIQUIJANA","1212","1212 - QUIQUIJANA"]
[null,null,null,null,null,null,null,null,null,null,null,null,null,null,"000002337","PAMPACONGA                                                                                          ","02","04","03","06","0204","000002337 - PAMPACONGA                                                                                          ",null,null,null,null,null,"13","00","(All)","1300","1300 - (All)"]
[null,null,null,null,null,null,null,null,null,null,null,null,null,null,"000002338","MOLLEPATA                                                                                           ","02","04","03","07","0204","000002338 - MOLLEPATA                                                                                           ",null,null,null,null,null,"13","01","URUBAMBA","1301","1301 - URUBAMBA"]
[null,null,null,null,null,null,null,null,null,null,null,null,null,null,"000010761","URATARI                                                                                             ","02","04","03","06","0204","000010761 - URATARI                                                                                             ",null,null,null,null,null,"13","02","CHINCHERO","1302","1302 - CHINCHERO"]
[null,null,null,null,null,null,null,null,null,null,null,null,null,null,"000021061","HUAMANPATA                                                                                          ","02","04","03","07","0204","000021061 - HUAMANPATA                                                                                          ",null,null,null,null,null,"13","03","HUAYLLABAMBA","1303","1303 - HUAYLLABAMBA"]
[null,null,null,null,null,null,null,null,null,null,null,null,null,null,"000000000","(All)","02","05",null,null,"0205","000000000 - (All)",null,null,null,null,null,"13","04","MACHUPICCHU","1304","1304 - MACHUPICCHU"]
[null,null,null,null,null,null,null,null,null,null,null,null,null,null,"000002343","COYA                                                                                                ","02","05","04","02","0205","000002343 - COYA                                                                                                ",null,null,null,null,null,"13","05","MARAS","1305","1305 - MARAS"]
[null,null,null,null,null,null,null,null,null,null,null,null,null,null,"000002344","LAMAY                                                                                               ","02","05","04","03","0205","000002344 - LAMAY                                                                                               ",null,null,null,null,null,"13","06","OLLANTAYTAMBO","1306","1306 - OLLANTAYTAMBO"]
[null,null,null,null,null,null,null,null,null,null,null,null,null,null,"000002348","PISAC                                                                                               ","02","05","04","05","0205","000002348 - PISAC                                                                                               ",null,null,null,null,null,"13","07","YUCAY","1307","1307 - YUCAY"]
[null,null,null,null,null,null,null,null,null,null,null,null,null,null,"000002349","CUYO CHICO                                                                                          ","02","05","04","05","0205",{"$f":"CONCATENATE(O139,\" - \",P139)","v":"000002349 - CUYO CHICO                                                                                          "},null,null,null,null,null,"00","00","(All)","0000","0000 - (All)"]
[null,null,null,null,null,null,null,null,null,null,null,null,null,null,"000002350","CUYO GRANDE                                                                                         ","02","05","04","05","0205","000002350 - CUYO GRANDE                                                                                         "]
[null,null,null,null,null,null,null,null,null,null,null,null,null,null,"000002351","QUELLO QUELLO                                                                                       ","02","05","04","05","0205","000002351 - QUELLO QUELLO                                                                                       "]
[null,null,null,null,null,null,null,null,null,null,null,null,null,null,"000002352","SAN SALVADOR                                                                                        ","02","05","04","06","0205","000002352 - SAN SALVADOR                                                                                        "]
[null,null,null,null,null,null,null,null,null,null,null,null,null,null,"000002353","TARAY                                                                                               ","02","05","04","07","0205","000002353 - TARAY                                                                                               "]
[null,null,null,null,null,null,null,null,null,null,null,null,null,null,"000002354","HUANCALLE                                                                                           ","02","05","04","07","0205","000002354 - HUANCALLE                                                                                           "]
[null,null,null,null,null,null,null,null,null,null,null,null,null,null,"000006970","TIRACANCHA                                                                                          ","02","05","04","06","0205","000006970 - TIRACANCHA                                                                                          "]
[null,null,null,null,null,null,null,null,null,null,null,null,null,null,"000006975","SAYLLAFAYA                                                                                          ","02","05","04","03","0205","000006975 - SAYLLAFAYA                                                                                          "]
[null,null,null,null,null,null,null,null,null,null,null,null,null,null,"000007145","HUAMA                                                                                               ","02","05","04","03","0205","000007145 - HUAMA                                                                                               "]
[null,null,null,null,null,null,null,null,null,null,null,null,null,null,"000007146","POQUES                                                                                              ","02","05","04","03","0205","000007146 - POQUES                                                                                              "]
[null,null,null,null,null,null,null,null,null,null,null,null,null,null,"000025368","HUARQUI","02","05","04","03","0205","000025368 - HUARQUI"]
[null,null,null,null,null,null,null,null,null,null,null,null,null,null,"000000000","(All)","02","06",null,null,"0206","000000000 - (All)"]
[null,null,null,null,null,null,null,null,null,null,null,null,null,null,"000002341","CALCA                                                                                               ","02","06","04","01","0206","000002341 - CALCA                                                                                               "]
[null,null,null,null,null,null,null,null,null,null,null,null,null,null,"000002342","AMPARAES                                                                                            ","02","06","04","04","0206","000002342 - AMPARAES                                                                                            "]
[null,null,null,null,null,null,null,null,null,null,null,null,null,null,"000002345","CCACHIN                                                                                             ","02","06","04","04","0206","000002345 - CCACHIN                                                                                             "]
[null,null,null,null,null,null,null,null,null,null,null,null,null,null,"000002346","CHOQUECANCHA                                                                                        ","02","06","04","04",{"$f":"CONCATENATE(Q154,R154)","v":"0206"},"000002346 - CHOQUECANCHA                                                                                        "]
[null,null,null,null,null,null,null,null,null,null,null,null,null,null,"000002347","LARES                                                                                               ","02","06","04","04","0206","000002347 - LARES                                                                                               "]
[null,null,null,null,null,null,null,null,null,null,null,null,null,null,"000002361","SUYO                                                                                                ","02","06","04","04","0206","000002361 - SUYO                                                                                                "]
[null,null,null,null,null,null,null,null,null,null,null,null,null,null,"000002515","PAROBAMBA                                                                                           ","02","06",11,"03","0206","000002515 - PAROBAMBA                                                                                           "]
[null,null,null,null,null,null,null,null,null,null,null,null,null,null,"000007143","OTOCANI                                                                                             ","02","06",11,"03","0206","000007143 - OTOCANI                                                                                             "]
[null,null,null,null,null,null,null,null,null,null,null,null,null,null,"000007144","PATABAMBA                                                                                           ","02","06","04","07","0206","000007144 - PATABAMBA                                                                                           "]
[null,null,null,null,null,null,null,null,null,null,null,null,null,null,"000010069","ESSALUD-CALCA","02","06","04","01","0206","000010069 - ESSALUD-CALCA"]
[null,null,null,null,null,null,null,null,null,null,null,null,null,null,"000010759","HUARAN                                                                                              ","02","06","04","01","0206","000010759 - HUARAN                                                                                              "]
[null,null,null,null,null,null,null,null,null,null,null,null,null,null,"000010762","ACCHA ALTA - PAMPALLACTA                                                                            ","02","06","04","01","0206","000010762 - ACCHA ALTA - PAMPALLACTA                                                                            "]
[null,null,null,null,null,null,null,null,null,null,null,null,null,null,"000026273","MENTAL COMUNITARIO CALCA","02","06","04","01","0206","000026273 - MENTAL COMUNITARIO CALCA"]
[null,null,null,null,null,null,null,null,null,null,null,null,null,null,"000000000","(All)","02","07",null,null,"0207","000000000 - (All)"]
[null,null,null,null,null,null,null,null,null,null,null,null,null,null,"000002540","URUBAMBA                                                                                            ","02","07",13,"01","0207","000002540 - URUBAMBA                                                                                            "]
[null,null,null,null,null,null,null,null,null,null,null,null,null,null,"000002541","YANAHUARA                                                                                           ","02","07",13,"01","0207","000002541 - YANAHUARA                                                                                           "]
[null,null,null,null,null,null,null,null,null,null,null,null,null,null,"000002543","CHINCHERO                                                                                           ","02","07",13,"02","0207","000002543 - CHINCHERO                                                                                           "]
[null,null,null,null,null,null,null,null,null,null,null,null,null,null,"000002544","OCCOTUAN                                                                                            ","02","07",13,"02","0207","000002544 - OCCOTUAN                                                                                            "]
[null,null,null,null,null,null,null,null,null,null,null,null,null,null,"000002545","HUAYLLABAMBA                                                                                        ","02","07",13,"03","0207","000002545 - HUAYLLABAMBA                                                                                        "]
[null,null,null,null,null,null,null,null,null,null,null,null,null,null,"000002546","MACHUPICCHU                                                                                         ","02","07",13,"04","0207","000002546 - MACHUPICCHU                                                                                         "]
[null,null,null,null,null,null,null,null,null,null,null,null,null,null,"000002547","COLLPANI                                                                                            ","02","07",13,"04","0207","000002547 - COLLPANI                                                                                            "]
[null,null,null,null,null,null,null,null,null,null,null,null,null,null,"000002548","MARAS                                                                                               ","02","07",13,"05","0207","000002548 - MARAS                                                                                               "]
[null,null,null,null,null,null,null,null,null,null,null,null,null,null,"000002549","OLLANTAYTAMBO                                                                                       ","02","07",13,"06","0207","000002549 - OLLANTAYTAMBO                                                                                       "]
[null,null,null,null,null,null,null,null,null,null,null,null,null,null,"000002550","CHILLCA                                                                                            ","02","07",13,"06","0207","000002550 - CHILLCA                                                                                            "]
[null,null,null,null,null,null,null,null,null,null,null,null,null,null,"000002551","YUCAY                                                                                               ","02","07",13,"07","0207","000002551 - YUCAY                                                                                               "]
[null,null,null,null,null,null,null,null,null,null,null,null,null,null,"000006974","CAMINO INCA HUAYLLABAMBA                                                                            ","02","07",13,"04","0207","000006974 - CAMINO INCA HUAYLLABAMBA                                                                            "]
[null,null,null,null,null,null,null,null,null,null,null,null,null,null,"000010060","ESSALUD-URUBAMBA","02","07",13,"01","0207","000010060 - ESSALUD-URUBAMBA"]
[null,null,null,null,null,null,null,null,null,null,null,null,null,null,"000010073","ESSALUD-MACHU PICCHU","02","07",13,"04","0207","000010073 - ESSALUD-MACHU PICCHU"]
[null,null,null,null,null,null,null,null,null,null,null,null,null,null,"000010758","CRUZPATA                                                                                            ","02","07",13,"05","0207","000010758 - CRUZPATA                                                                                            "]
[null,null,null,null,null,null,null,null,null,null,null,null,null,null,"000010760","PATACANCHA                                                                                          ","02","07",13,"06","0207","000010760 - PATACANCHA                                                                                          "]
[null,null,null,null,null,null,null,null,null,null,null,null,null,null,"000030666","MENTAL COMUNITARIO URUBAMBA","02","07",13,"01","0207","000030666 - MENTAL COMUNITARIO URUBAMBA"]
[null,null,null,null,null,null,null,null,null,null,null,null,null,null,"000000000","(All)","02","08",null,null,"0208","000000000 - (All)"]
[null,null,null,null,null,null,null,null,null,null,null,null,null,null,"000002355","LA QUEBRADA                                                                                         ","02","08","04","08","0208","000002355 - LA QUEBRADA                                                                                         "]
[null,null,null,null,null,null,null,null,null,null,null,null,null,null,"000002356","CCORIMAYO                                                                                           ","02","08","04","08","0208","000002356 - CCORIMAYO                                                                                           "]
[null,null,null,null,null,null,null,null,null,null,null,null,null,null,"000002357","COLCCA YANATILE                                                                                     ","02","08","04","08","0208","000002357 - COLCCA YANATILE                                                                                     "]
[null,null,null,null,null,null,null,null,null,null,null,null,null,null,"000002358","MUYUPAY                                                                                             ","02","08","04","08","0208","000002358 - MUYUPAY                                                                                             "]
[null,null,null,null,null,null,null,null,null,null,null,null,null,null,"000002359","PUTUCUSI                                                                                            ","02","08","04","08","0208","000002359 - PUTUCUSI                                                                                            "]
[null,null,null,null,null,null,null,null,null,null,null,null,null,null,"000002360","QUESQUENTO                                                                                          ","02","08","04","08","0208","000002360 - QUESQUENTO                                                                                          "]
[null,null,null,null,null,null,null,null,null,null,null,null,null,null,"000002362","HUACHIBAMBA                                                                                         ","02","08","04","08","0208","000002362 - HUACHIBAMBA                                                                                         "]
[null,null,null,null,null,null,null,null,null,null,null,null,null,null,"000002464","VERSALLES                                                                                           ","02","08","09","05","0208","000002464 - VERSALLES                                                                                           "]
[null,null,null,null,null,null,null,null,null,null,null,null,null,null,"000002467","PUENTE SANTIAGO                                                                                     ","02","08","09","06","0208","000002467 - PUENTE SANTIAGO                                                                                     "]
[null,null,null,null,null,null,null,null,null,null,null,null,null,null,"000006971","COMBAPATA YANATILE                                                                                  ","02","08","04","08","0208","000006971 - COMBAPATA YANATILE                                                                                  "]
[null,null,null,null,null,null,null,null,null,null,null,null,null,null,"000006973","BELLAVISTA                                                                                          ","02","08","04","08","0208","000006973 - BELLAVISTA                                                                                          "]
[null,null,null,null,null,null,null,null,null,null,null,null,null,null,"000007142","CHANCAMAYO                                                                                          ","02","08","04","08","0208","000007142 - CHANCAMAYO                                                                                          "]
[null,null,null,null,null,null,null,null,null,null,null,null,null,null,"000000000","(All)","02","09",null,null,"0209","000000000 - (All)"]
[null,null,null,null,null,null,null,null,null,null,null,null,null,null,"000002290","SAN PEDRO CUSCO                                                                                     ","02","09","01","01","0209","000002290 - SAN PEDRO CUSCO                                                                                     "]
[null,null,null,null,null,null,null,null,null,null,null,null,null,null,"000002291","SIETE CUARTONES                                                                                     ","02","09","01","01","0209","000002291 - SIETE CUARTONES                                                                                     "]
[null,null,null,null,null,null,null,null,null,null,null,null,null,null,"000002293","MIRAFLORES                                                                                          ","02","09","01","01","0209","000002293 - MIRAFLORES                                                                                          "]
[null,null,null,null,null,null,null,null,null,null,null,null,null,null,"000002294","PICCHU LA RINCONADA                                                                                 ","02","09","01","01","0209","000002294 - PICCHU LA RINCONADA                                                                                 "]
[null,null,null,null,null,null,null,null,null,null,null,null,null,null,"000002295","BUENA VISTA                                                                                         ","02","09","01","01","0209","000002295 - BUENA VISTA                                                                                         "]
[null,null,null,null,null,null,null,null,null,null,null,null,null,null,"000002299","POROY                                                                                               ","02","09","01","03","0209","000002299 - POROY                                                                                               "]
[null,null,null,null,null,null,null,null,null,null,null,null,null,null,"999999999","(All)","02","99",null,null,"0299","999999999 - (All)"]
[null,null,null,null,null,null,null,null,null,null,null,null,null,null,"000002421","HOSPITAL QUILLABAMBA","03","00","09","01",{"$f":"CONCATENATE(Q203,R203)","v":"0300"},{"$f":"CONCATENATE(O203,\" - \",P203)","v":"000002421 - HOSPITAL QUILLABAMBA"}]
[null,null,null,null,null,null,null,null,null,null,null,null,null,null,"000000000","(All)","03","01",null,null,{"$f":"CONCATENATE(Q204,R204)","v":"0301"},{"$f":"CONCATENATE(O204,\" - \",P204)","v":"000000000 - (All)"}]
[null,null,null,null,null,null,null,null,null,null,null,null,null,null,"000002422","HUAYANAY                                                                                            ","03","01","09","01",{"$f":"CONCATENATE(Q205,R205)","v":"0301"},{"$f":"CONCATENATE(O205,\" - \",P205)","v":"000002422 - HUAYANAY                                                                                            "}]
[null,null,null,null,null,null,null,null,null,null,null,null,null,null,"000002423","IDMA                                                                                                ","03","01","09","01","0301",{"$f":"CONCATENATE(O206,\" - \",P206)","v":"000002423 - IDMA                                                                                                "}]
[null,null,null,null,null,null,null,null,null,null,null,null,null,null,"000002424","POTRERO                                                                                             ","03","01","09","01","0301",{"$f":"CONCATENATE(O207,\" - \",P207)","v":"000002424 - POTRERO                                                                                             "}]
[null,null,null,null,null,null,null,null,null,null,null,null,null,null,"000002425","ECHARATE                                                                                            ","03","01","09","02","0301","000002425 - ECHARATE                                                                                            "]
[null,null,null,null,null,null,null,null,null,null,null,null,null,null,"000002429","CIRIALO                                                                                             ","03","01","09","02","0301","000002429 - CIRIALO                                                                                             "]
[null,null,null,null,null,null,null,null,null,null,null,null,null,null,"000002430","PAMPA CONCEPCION                                                                                    ","03","01","09","02","0301","000002430 - PAMPA CONCEPCION                                                                                    "]
[null,null,null,null,null,null,null,null,null,null,null,null,null,null,"000002433","KORIBENI                                                                                            ","03","01","09","02","0301","000002433 - KORIBENI                                                                                            "]
[null,null,null,null,null,null,null,null,null,null,null,null,null,null,"000002439","PALMA REAL                                                                                          ","03","01","09","02","0301","000002439 - PALMA REAL                                                                                          "]
[null,null,null,null,null,null,null,null,null,null,null,null,null,null,"000002446","CHACCO                                                                                              ","03","01","09","02","0301","000002446 - CHACCO                                                                                              "]
[null,null,null,null,null,null,null,null,null,null,null,null,null,null,"000002449","ICHIQUIATO                                                                                          ","03","01","09","02","0301","000002449 - ICHIQUIATO                                                                                          "]
[null,null,null,null,null,null,null,null,null,null,null,null,null,null,"000002450","SAN ANTONIO                                                                                         ","03","01","09","02","0301","000002450 - SAN ANTONIO                                                                                         "]
[null,null,null,null,null,null,null,null,null,null,null,null,null,null,"000002451","CHAHUARES                                                                                           ","03","01","09","02","0301","000002451 - CHAHUARES                                                                                           "]
[null,null,null,null,null,null,null,null,null,null,null,null,null,null,"000008910","SANTA ANA                                                                                           ","03","01","09","01","0301","000008910 - SANTA ANA                                                                                           "]
[null,null,null,null,null,null,null,null,null,null,null,null,null,null,"000010062","ESSALUD-QUILLABAMBA","03","01","09","01","0301","000010062 - ESSALUD-QUILLABAMBA"]
[null,null,null,null,null,null,null,null,null,null,null,null,null,null,"000011744","SANIDAD-QUILLABAMBA PNP","03","01","09","01","0301","000011744 - SANIDAD-QUILLABAMBA PNP"]
[null,null,null,null,null,null,null,null,null,null,null,null,null,null,"000015842","PAVAYOC                                                                                             ","03","01","09","01","0301","000015842 - PAVAYOC                                                                                             "]
[null,null,null,null,null,null,null,null,null,null,null,null,null,null,"000023721","EJERCITO-PERUANO","03","01","09","01","0301","000023721 - EJERCITO-PERUANO"]
[null,null,null,null,null,null,null,null,null,null,null,null,null,null,"000026386","MENTAL QUILLABAMBA","03","01","09","01","0301","000026386 - MENTAL QUILLABAMBA"]
[null,null,null,null,null,null,null,null,null,null,null,null,null,null,"000033273","SAN ISIDRO LABRADOR - ECHARATI","03","01","09","02","0301","000033273 - SAN ISIDRO LABRADOR - ECHARATI"]
[null,null,null,null,null,null,null,null,null,null,null,null,null,null,"000000000","(All)","03","02",null,null,"0302","000000000 - (All)"]
[null,null,null,null,null,null,null,null,null,null,null,null,null,null,"000002453","HUYRO                                                                                               ","03","02","09","03","0302","000002453 - HUYRO                                                                                               "]
[null,null,null,null,null,null,null,null,null,null,null,null,null,null,"000002454","ALFAMAYO                                                                                            ","03","02","09","03","0302","000002454 - ALFAMAYO                                                                                            "]
[null,null,null,null,null,null,null,null,null,null,null,null,null,null,"000002455","HUAYOPATA                                                                                           ","03","02","09","03","0302","000002455 - HUAYOPATA                                                                                           "]
[null,null,null,null,null,null,null,null,null,null,null,null,null,null,"000002456","AMAYBAMBA                                                                                           ","03","02","09","03","0302","000002456 - AMAYBAMBA                                                                                           "]
[null,null,null,null,null,null,null,null,null,null,null,null,null,null,"000002457","SAN PABLO HUAYOPATA                                                                                 ","03","02","09","03","0302","000002457 - SAN PABLO HUAYOPATA                                                                                 "]
[null,null,null,null,null,null,null,null,null,null,null,null,null,null,"000002458","MARANURA                                                                                            ","03","02","09","04","0302","000002458 - MARANURA                                                                                            "]
[null,null,null,null,null,null,null,null,null,null,null,null,null,null,"000002460","SANTA MARIA                                                                                         ","03","02","09","04","0302","000002460 - SANTA MARIA                                                                                         "]
[null,null,null,null,null,null,null,null,null,null,null,null,null,null,"000002461","UCHUMAYO                                                                                            ","03","02","09","04","0302","000002461 - UCHUMAYO                                                                                            "]
[null,null,null,null,null,null,null,null,null,null,null,null,null,null,"000002476","SANTA TERESA                                                                                        ","03","02","09","08","0302","000002476 - SANTA TERESA                                                                                        "]
[null,null,null,null,null,null,null,null,null,null,null,null,null,null,"000002477","SULLUCUYOC                                                                                          ","03","02","09","08","0302","000002477 - SULLUCUYOC                                                                                          "]
[null,null,null,null,null,null,null,null,null,null,null,null,null,null,"000002478","TOTORA                                                                                              ","03","02","09","08","0302","000002478 - TOTORA                                                                                              "]
[null,null,null,null,null,null,null,null,null,null,null,null,null,null,"000010075","ESSALUD-HUYRO","03","02","09","03","0302","000010075 - ESSALUD-HUYRO"]
[null,null,null,null,null,null,null,null,null,null,null,null,null,null,"000000000","(All)","03","03",null,null,"0303","000000000 - (All)"]
[null,null,null,null,null,null,null,null,null,null,null,null,null,null,"000002363","TUPAC AMARU QUELLOUNO                                                                               ","03","03","04","08","0303","000002363 - TUPAC AMARU QUELLOUNO                                                                               "]
[null,null,null,null,null,null,null,null,null,null,null,null,null,null,"000002462","OCCOBAMBA LACONVENCION                                                                              ","03","03","09","05","0303","000002462 - OCCOBAMBA LACONVENCION                                                                              "]
[null,null,null,null,null,null,null,null,null,null,null,null,null,null,"000002463","CHINGANILLA                                                                                         ","03","03","09","05","0303","000002463 - CHINGANILLA                                                                                         "]
[null,null,null,null,null,null,null,null,null,null,null,null,null,null,"000002465","QUELLOUNO                                                                                           ","03","03","09","06","0303","000002465 - QUELLOUNO                                                                                           "]
[null,null,null,null,null,null,null,null,null,null,null,null,null,null,"000002466","HUILLCAPAMPA                                                                                        ","03","03","09","06","0303","000002466 - HUILLCAPAMPA                                                                                        "]
[null,null,null,null,null,null,null,null,null,null,null,null,null,null,"000002468","SAN MARTIN                                                                                          ","03","03","09","06","0303","000002468 - SAN MARTIN                                                                                          "]
[null,null,null,null,null,null,null,null,null,null,null,null,null,null,"000008906","ESTRELLA                                                                                            ","03","03","09","06","0303","000008906 - ESTRELLA                                                                                            "]
[null,null,null,null,null,null,null,null,null,null,null,null,null,null,"000008907","MATORIATO                                                                                           ","03","03","09","06","0303","000008907 - MATORIATO                                                                                           "]
[null,null,null,null,null,null,null,null,null,null,null,null,null,null,"000008908","CHIRUMBIA                                                                                           ","03","03","09","06","0303","000008908 - CHIRUMBIA                                                                                           "]
[null,null,null,null,null,null,null,null,null,null,null,null,null,null,"000008909","CHAPO BOYERO                                                                                        ","03","03","09","06","0303","000008909 - CHAPO BOYERO                                                                                        "]
[null,null,null,null,null,null,null,null,null,null,null,null,null,null,"000000000","(All)","03","04",null,null,"0304","000000000 - (All)"]
[null,null,null,null,null,null,null,null,null,null,null,null,null,null,"000002427","KITENI                                                                                              ","03","04","09","02","0304","000002427 - KITENI                                                                                              "]
[null,null,null,null,null,null,null,null,null,null,null,null,null,null,"000002431","IVOCHOTE                                                                                            ","03","04","09","02","0304","000002431 - IVOCHOTE                                                                                            "]
[null,null,null,null,null,null,null,null,null,null,null,null,null,null,"000002432","KEPASHIATO                                                                                          ","03","04","09","15","0304","000002432 - KEPASHIATO                                                                                          "]
[null,null,null,null,null,null,null,null,null,null,null,null,null,null,"000002434","MATERIATO                                                                                           ","03","04","09","15","0304","000002434 - MATERIATO                                                                                           "]
[null,null,null,null,null,null,null,null,null,null,null,null,null,null,"000002438","PACHIRI                                                                                             ","03","04","09","02","0304","000002438 - PACHIRI                                                                                             "]
[null,null,null,null,null,null,null,null,null,null,null,null,null,null,"000002440","PANGOA                                                                                              ","03","04","09","02","0304","000002440 - PANGOA                                                                                              "]
[null,null,null,null,null,null,null,null,null,null,null,null,null,null,"000002443","SANIRIATO                                                                                           ","03","04","09","02","0304","000002443 - SANIRIATO                                                                                           "]
[null,null,null,null,null,null,null,null,null,null,null,null,null,null,"000002447","KAMANQUIRIATO                                                                                       ","03","04","09","02","0304","000002447 - KAMANQUIRIATO                                                                                       "]
[null,null,null,null,null,null,null,null,null,null,null,null,null,null,"000002489","YUVENI                                                                                              ","03","04","09","09","0304","000002489 - YUVENI                                                                                              "]
[null,null,null,null,null,null,null,null,null,null,null,null,null,null,"000002493","SELVA ALEGRE                                                                                        ","03","04","09","09","0304","000002493 - SELVA ALEGRE                                                                                        "]
[null,null,null,null,null,null,null,null,null,null,null,null,null,null,"000006976","CHONTABAMBA                                                                                         ","03","04","09","09","0304","000006976 - CHONTABAMBA                                                                                         "]
[null,null,null,null,null,null,null,null,null,null,null,null,null,null,"000013068","TRIO RIO                                                                                            ","03","04","09","15","0304","000013068 - TRIO RIO                                                                                            "]
[null,null,null,null,null,null,null,null,null,null,null,null,null,null,"000013069","PUGUIENTIMARI                                                                                       ","03","04","09","15","0304","000013069 - PUGUIENTIMARI                                                                                       "]
[null,null,null,null,null,null,null,null,null,null,null,null,null,null,"000014531","ESSALUD-ECHARATE/KITENI","03","04","09","02","0304","000014531 - ESSALUD-ECHARATE/KITENI"]
[null,null,null,null,null,null,null,null,null,null,null,null,null,null,"000024583","EJERCITO-KEPASHIATO 314","03","04","09","02","0304","000024583 - EJERCITO-KEPASHIATO 314"]
[null,null,null,null,null,null,null,null,null,null,null,null,null,null,"000024296","EJERCITO-MIARIA 334","03","04","09","02","0304","000024296 - EJERCITO-MIARIA 334"]
[null,null,null,null,null,null,null,null,null,null,null,null,null,null,"000000000","(All)","03","05",null,null,"0305","000000000 - (All)"]
[null,null,null,null,null,null,null,null,null,null,null,null,null,null,"000002426","KIRIGUETI                                                                                           ","03","05","09","14","0305","000002426 - KIRIGUETI                                                                                           "]
[null,null,null,null,null,null,null,null,null,null,null,null,null,null,"000002428","CHOCORIARI                                                                                          ","03","05","09","14","0305","000002428 - CHOCORIARI                                                                                          "]
[null,null,null,null,null,null,null,null,null,null,null,null,null,null,"000002435","MIARIA                                                                                              ","03","05","09","14","0305","000002435 - MIARIA                                                                                              "]
[null,null,null,null,null,null,null,null,null,null,null,null,null,null,"000002436","NUEVA LUZ                                                                                           ","03","05","09","14",{"$f":"CONCATENATE(Q269,R269)","v":"0305"},"000002436 - NUEVA LUZ                                                                                           "]
[null,null,null,null,null,null,null,null,null,null,null,null,null,null,"000002437","NUEVO MUNDO                                                                                         ","03","05","09","14","0305","000002437 - NUEVO MUNDO                                                                                         "]
[null,null,null,null,null,null,null,null,null,null,null,null,null,null,"000002441","PUERTO HUALLANA                                                                                     ","03","05","09","14","0305",{"$f":"CONCATENATE(O271,\" - \",P271)","v":"000002441 - PUERTO HUALLANA                                                                                     "}]
[null,null,null,null,null,null,null,null,null,null,null,null,null,null,"000002442","PUERTO RICO                                                                                         ","03","05","09","14","0305","000002442 - PUERTO RICO                                                                                         "]
[null,null,null,null,null,null,null,null,null,null,null,null,null,null,"000002444","SENSA                                                                                               ","03","05","09","14","0305","000002444 - SENSA                                                                                               "]
[null,null,null,null,null,null,null,null,null,null,null,null,null,null,"000002445","TIMPIA                                                                                              ","03","05","09","14","0305","000002445 - TIMPIA                                                                                              "]
[null,null,null,null,null,null,null,null,null,null,null,null,null,null,"000002448","KAMISEA                                                                                             ","03","05","09","14","0305","000002448 - KAMISEA                                                                                             "]
[null,null,null,null,null,null,null,null,null,null,null,null,null,null,"000002452","SHIVANKORENI                                                                                        ","03","05","09","14","0305","000002452 - SHIVANKORENI                                                                                        "]
[null,null,null,null,null,null,null,null,null,null,null,null,null,null,"000013066","MONTETONI                                                                                           ","03","05","09","14","0305","000013066 - MONTETONI                                                                                           "]
[null,null,null,null,null,null,null,null,null,null,null,null,null,null,"000013067","TANGOSHIARI                                                                                         ","03","05","09","14","0305","000013067 - TANGOSHIARI                                                                                         "]
[null,null,null,null,null,null,null,null,null,null,null,null,null,null,"000015235","NUEVA VIDA                                                                                          ","03","05","09","14","0305","000015235 - NUEVA VIDA                                                                                          "]
[null,null,null,null,null,null,null,null,null,null,null,null,null,null,"000015843","CASHIRIARI                                                                                          ","03","05","09","14","0305","000015843 - CASHIRIARI                                                                                          "]
[null,null,null,null,null,null,null,null,null,null,null,null,null,null,"000015844","CAMANA                                                                                              ","03","05","09","14","0305","000015844 - CAMANA                                                                                              "]
[null,null,null,null,null,null,null,null,null,null,null,null,null,null,"000000000","(All)","03","06",null,null,"0306","000000000 - (All)"]
[null,null,null,null,null,null,null,null,null,null,null,null,null,null,"000002480","PUCYURA                                                                                             ","03","06","09","09","0306","000002480 - PUCYURA                                                                                             "]
[null,null,null,null,null,null,null,null,null,null,null,null,null,null,"000002481","CCARCCO                                                                                             ","03","06","09",11,"0306","000002481 - CCARCCO                                                                                             "]
[null,null,null,null,null,null,null,null,null,null,null,null,null,null,"000002482","INCAHUASI                                                                                           ","03","06","09",11,"0306","000002482 - INCAHUASI                                                                                           "]
[null,null,null,null,null,null,null,null,null,null,null,null,null,null,"000002484","OYARA                                                                                               ","03","06","09","09","0306","000002484 - OYARA                                                                                               "]
[null,null,null,null,null,null,null,null,null,null,null,null,null,null,"000002485","PACCAYBAMBA                                                                                         ","03","06","09",11,"0306","000002485 - PACCAYBAMBA                                                                                         "]
[null,null,null,null,null,null,null,null,null,null,null,null,null,null,"000002486","PAMPACONAS                                                                                          ","03","06","09","09","0306","000002486 - PAMPACONAS                                                                                          "]
[null,null,null,null,null,null,null,null,null,null,null,null,null,null,"000002487","CHOQUETIRA                                                                                          ","03","06","09",11,"0306","000002487 - CHOQUETIRA                                                                                          "]
[null,null,null,null,null,null,null,null,null,null,null,null,null,null,"000002490","ARMA                                                                                                ","03","06","09","09","0306","000002490 - ARMA                                                                                                "]
[null,null,null,null,null,null,null,null,null,null,null,null,null,null,"000002491","LUCMAHUAYCO                                                                                         ","03","06","09",11,"0306","000002491 - LUCMAHUAYCO                                                                                         "]
[null,null,null,null,null,null,null,null,null,null,null,null,null,null,"000002492","PALTAYBAMBA                                                                                         ","03","06","09","09","0306","000002492 - PALTAYBAMBA                                                                                         "]
[null,null,null,null,null,null,null,null,null,null,null,null,null,null,"000013070","CHANCAVINE                                                                                          ","03","06","09",12,"0306","000013070 - CHANCAVINE                                                                                          "]
[null,null,null,null,null,null,null,null,null,null,null,null,null,null,"000024637","EJERCITO-INCAHUASI 331                                                                                       ","03","06","09",11,"0306","000024637 - EJERCITO-INCAHUASI 331                                                                                       "]
[null,null,null,null,null,null,null,null,null,null,null,null,null,null,"999999999","(All)","03","99",null,null,"0399","999999999 - (All)"]
[null,null,null,null,null,null,null,null,null,null,null,null,null,null,"000002378","HOSPITAL SICUANI","04","00","06","01","0400","000002378 - HOSPITAL SICUANI"]
[null,null,null,null,null,null,null,null,null,null,null,null,null,null,"000007135","HOSPITAL ESPINAR","04","00","08","01","0400","000007135 - HOSPITAL ESPINAR"]
[null,null,null,null,null,null,null,null,null,null,null,null,null,null,"000000000","(All)","04","01",null,null,"0401","000000000 - (All)"]
[null,null,null,null,null,null,null,null,null,null,null,null,null,null,"000002364","YANAOCA                                                                                             ","04","01","05","01","0401","000002364 - YANAOCA                                                                                             "]
[null,null,null,null,null,null,null,null,null,null,null,null,null,null,"000002365","PONGOÑA                                                                                             ","04","01","05","01","0401","000002365 - PONGOÑA                                                                                             "]
[null,null,null,null,null,null,null,null,null,null,null,null,null,null,"000002372","PAMPAMARCA                                                                                          ","04","01","05","06","0401","000002372 - PAMPAMARCA                                                                                          "]
[null,null,null,null,null,null,null,null,null,null,null,null,null,null,"000002373","QUEHUE                                                                                              ","04","01","05","07","0401","000002373 - QUEHUE                                                                                              "]
[null,null,null,null,null,null,null,null,null,null,null,null,null,null,"000002374","HUINCHIRI                                                                                           ","04","01","05","07","0401","000002374 - HUINCHIRI                                                                                           "]
[null,null,null,null,null,null,null,null,null,null,null,null,null,null,"000002375","SURIMANA                                                                                            ","04","01","05","08","0401","000002375 - SURIMANA                                                                                            "]
[null,null,null,null,null,null,null,null,null,null,null,null,null,null,"000002376","TUNGASUCA                                                                                           ","04","01","05","08","0401","000002376 - TUNGASUCA                                                                                           "]
[null,null,null,null,null,null,null,null,null,null,null,null,null,null,"000002377","TOCCOCCORI                                                                                          ","04","01","05","08","0401","000002377 - TOCCOCCORI                                                                                          "]
[null,null,null,null,null,null,null,null,null,null,null,null,null,null,"000018241","HAMPATURA                                                                                           ","04","01","05","01","0401","000018241 - HAMPATURA                                                                                           "]
[null,null,null,null,null,null,null,null,null,null,null,null,null,null,"000032339","CCOCHAPATA                                                                                     ","04","01","05","08","0401","000032339 - CCOCHAPATA                                                                                     "]
[null,null,null,null,null,null,null,null,null,null,null,null,null,null,"000034449","CHAUPIBANDA","04","01","05","08","0401","000034449 - CHAUPIBANDA"]
[null,null,null,null,null,null,null,null,null,null,null,null,null,null,"000000000","(All)","04","02",null,null,"0402","000000000 - (All)"]
[null,null,null,null,null,null,null,null,null,null,null,null,null,null,"000002366","CHECCA                                                                                              ","04","02","05","02","0402","000002366 - CHECCA                                                                                              "]
[null,null,null,null,null,null,null,null,null,null,null,null,null,null,"000002367","CHITIBAMBA                                                                                          ","04","02","05","02","0402","000002367 - CHITIBAMBA                                                                                          "]
[null,null,null,null,null,null,null,null,null,null,null,null,null,null,"000007700","EL DESCANSO                                                                                         ","04","02","05","03","0402","000007700 - EL DESCANSO                                                                                         "]
[null,null,null,null,null,null,null,null,null,null,null,null,null,null,"000000000","(All)","04","03",null,null,"0403","000000000 - (All)"]
[null,null,null,null,null,null,null,null,null,null,null,null,null,null,"000002320","MOSOCLLACTA                                                                                         ","04","03","02","04","0403","000002320 - MOSOCLLACTA                                                                                         "]
[null,null,null,null,null,null,null,null,null,null,null,null,null,null,"000002385","CHECACUPE                                                                                           ","04","03","06","02","0403","000002385 - CHECACUPE                                                                                           "]
[null,null,null,null,null,null,null,null,null,null,null,null,null,null,"000002386","COMBAPATA CANCHIS                                                                                   ","04","03","06","03","0403","000002386 - COMBAPATA CANCHIS                                                                                   "]
[null,null,null,null,null,null,null,null,null,null,null,null,null,null,"000002387","CHIARA                                                                                              ","04","03","06","03","0403","000002387 - CHIARA                                                                                              "]
[null,null,null,null,null,null,null,null,null,null,null,null,null,null,"000002392","PITUMARCA                                                                                           ","04","03","06","05","0403","000002392 - PITUMARCA                                                                                           "]
[null,null,null,null,null,null,null,null,null,null,null,null,null,null,"000002397","TINTA                                                                                               ","04","03","06","08","0403","000002397 - TINTA                                                                                               "]
[null,null,null,null,null,null,null,null,null,null,null,null,null,null,"000000000","(All)","04","04",null,null,"0404","000000000 - (All)"]
[null,null,null,null,null,null,null,null,null,null,null,null,null,null,"000002369","LANGUI                                                                                              ","04","04","05","04","0404","000002369 - LANGUI                                                                                              "]
[null,null,null,null,null,null,null,null,null,null,null,null,null,null,"000002370","CONDEVILUYO                                                                                         ","04","04","05","04","0404","000002370 - CONDEVILUYO                                                                                         "]
[null,null,null,null,null,null,null,null,null,null,null,null,null,null,"000002371","LAYO                                                                                                ","04","04","05","05","0404","000002371 - LAYO                                                                                                "]
[null,null,null,null,null,null,null,null,null,null,null,null,null,null,"000002379","HERCCA                                                                                              ","04","04","06","01","0404","000002379 - HERCCA                                                                                              "]
[null,null,null,null,null,null,null,null,null,null,null,null,null,null,"000002380","TECHO OBRERO                                                                                        ","04","04","06","01","0404","000002380 - TECHO OBRERO                                                                                        "]
[null,null,null,null,null,null,null,null,null,null,null,null,null,null,"000002388","MARANGANI                                                                                           ","04","04","06","04","0404","000002388 - MARANGANI                                                                                           "]
[null,null,null,null,null,null,null,null,null,null,null,null,null,null,"000002389","CHECTUYOC                                                                                           ","04","04","06","04","0404","000002389 - CHECTUYOC                                                                                           "]
[null,null,null,null,null,null,null,null,null,null,null,null,null,null,"000002390","CCUYO                                                                                               ","04","04","06","04","0404","000002390 - CCUYO                                                                                               "]
[null,null,null,null,null,null,null,null,null,null,null,null,null,null,"000002391","OCCOBAMBA MARANGANI                                                                                 ","04","04","06","04","0404","000002391 - OCCOBAMBA MARANGANI                                                                                 "]
[null,null,null,null,null,null,null,null,null,null,null,null,null,null,"000010063","ESSALUD-SICUANI","04","04","06","01","0404","000010063 - ESSALUD-SICUANI"]
[null,null,null,null,null,null,null,null,null,null,null,null,null,null,"000024663","SANIDAD-SICUANI PNP","04","04","06","01","0404","000024663 - SANIDAD-SICUANI PNP"]
[null,null,null,null,null,null,null,null,null,null,null,null,null,null,"000000000","(All)","04","05",null,null,{"$f":"CONCATENATE(Q333,R333)","v":"0405"},"000000000 - (All)"]
[null,null,null,null,null,null,null,null,null,null,null,null,null,null,"000002381","QUEHUAR                                                                                             ","04","05","06","01","0405","000002381 - QUEHUAR                                                                                             "]
[null,null,null,null,null,null,null,null,null,null,null,null,null,null,"000002382","UZCUPATA                                                                                            ","04","05","06","01","0405",{"$f":"CONCATENATE(O335,\" - \",P335)","v":"000002382 - UZCUPATA                                                                                            "}]
[null,null,null,null,null,null,null,null,null,null,null,null,null,null,"000002383","LA FLORIDA                                                                                          ","04","05","06","01","0405","000002383 - LA FLORIDA                                                                                          "]
[null,null,null,null,null,null,null,null,null,null,null,null,null,null,"000002384","PAMPAPHALLA                                                                                         ","04","05","06","01","0405","000002384 - PAMPAPHALLA                                                                                         "]
[null,null,null,null,null,null,null,null,null,null,null,null,null,null,"000002393","PHINAYA                                                                                             ","04","05","06","05","0405","000002393 - PHINAYA                                                                                             "]
[null,null,null,null,null,null,null,null,null,null,null,null,null,null,"000002394","SAN PABLO CANCHIS                                                                                   ","04","05","06","06","0405","000002394 - SAN PABLO CANCHIS                                                                                   "]
[null,null,null,null,null,null,null,null,null,null,null,null,null,null,"000002395","SANTA BARBARA                                                                                       ","04","05","06","06","0405","000002395 - SANTA BARBARA                                                                                       "]
[null,null,null,null,null,null,null,null,null,null,null,null,null,null,"000002396","SAN PEDRO CANCHIS                                                                                   ","04","05","06","07","0405","000002396 - SAN PEDRO CANCHIS                                                                                   "]
[null,null,null,null,null,null,null,null,null,null,null,null,null,null,"000026387","MENTAL COMUNITARIO SICUANI","04","05","06","01","0405","000026387 - MENTAL COMUNITARIO SICUANI"]
[null,null,null,null,null,null,null,null,null,null,null,null,null,null,"000000000","(All)","04","06",null,null,"0406","000000000 - (All)"]
[null,null,null,null,null,null,null,null,null,null,null,null,null,null,"000002410","YAURI                                                                                               ","04","06","08","01","0406","000002410 - YAURI                                                                                               "]
[null,null,null,null,null,null,null,null,null,null,null,null,null,null,"000002411","CONDOROMA                                                                                           ","04","06","08","02","0406","000002411 - CONDOROMA                                                                                           "]
[null,null,null,null,null,null,null,null,null,null,null,null,null,null,"000002412","COPORAQUE                                                                                           ","04","06","08","03","0406","000002412 - COPORAQUE                                                                                           "]
[null,null,null,null,null,null,null,null,null,null,null,null,null,null,"000002413","URINSAYA                                                                                            ","04","06","08","03","0406","000002413 - URINSAYA                                                                                            "]
[null,null,null,null,null,null,null,null,null,null,null,null,null,null,"000002414","HUAYHUAHUASI                                                                                        ","04","06","08","03","0406","000002414 - HUAYHUAHUASI                                                                                        "]
[null,null,null,null,null,null,null,null,null,null,null,null,null,null,"000002415","OCCORURO                                                                                            ","04","06","08","04","0406","000002415 - OCCORURO                                                                                            "]
[null,null,null,null,null,null,null,null,null,null,null,null,null,null,"000002416","PALLPATA                                                                                            ","04","06","08","05","0406","000002416 - PALLPATA                                                                                            "]
[null,null,null,null,null,null,null,null,null,null,null,null,null,null,"000002417","PICHIGUA ESPINAR                                                                                    ","04","06","08","06","0406","000002417 - PICHIGUA ESPINAR                                                                                    "]
[null,null,null,null,null,null,null,null,null,null,null,null,null,null,"000002418","SAN MIGUEL                                                                                          ","04","06","08","06","0406","000002418 - SAN MIGUEL                                                                                          "]
[null,null,null,null,null,null,null,null,null,null,null,null,null,null,"000002419","SUYKUTAMBO                                                                                          ","04","06","08","07","0406","000002419 - SUYKUTAMBO                                                                                          "]
[null,null,null,null,null,null,null,null,null,null,null,null,null,null,"000002420","ACCOCUNCA                                                                                           ","04","06","08","08","0406","000002420 - ACCOCUNCA                                                                                           "]
[null,null,null,null,null,null,null,null,null,null,null,null,null,null,"000006745","TINTAYA MARQUIRI                                                                                    ","04","06","08","01","0406","000006745 - TINTAYA MARQUIRI                                                                                    "]
[null,null,null,null,null,null,null,null,null,null,null,null,null,null,"000010061","ESSALUD-ESPINAR","04","06","08","01","0406","000010061 - ESSALUD-ESPINAR"]
[null,null,null,null,null,null,null,null,null,null,null,null,null,null,"000030366","MENTAL COMUNITARIO ESPINAR","04","06","08","01","0406","000030366 - MENTAL COMUNITARIO ESPINAR"]
[null,null,null,null,null,null,null,null,null,null,null,null,null,null,"999999999","(All)","04","99",null,null,"0499","999999999 - (All)"]
[null,null,null,null,null,null,null,null,null,null,null,null,null,null,"000002469","SAN JUAN DE KIMBIRI-VRAEM                                                                           ","05","00","09","07","0500","000002469 - SAN JUAN DE KIMBIRI-VRAEM                                                                           "]
[null,null,null,null,null,null,null,null,null,null,null,null,null,null,"000000000","(All)","05","01",null,null,"0501","000000000 - (All)"]
[null,null,null,null,null,null,null,null,null,null,null,null,null,null,"000002470","CHIRUMPIARI                                                                                         ","05","01","09","16","0501","000002470 - CHIRUMPIARI                                                                                         "]
[null,null,null,null,null,null,null,null,null,null,null,null,null,null,"000002471","LOBO TAHUANTINSUYO                                                                                  ","05","01","09","17","0501","000002471 - LOBO TAHUANTINSUYO                                                                                  "]
[null,null,null,null,null,null,null,null,null,null,null,null,null,null,"000002472","MAPITUNARI                                                                                          ","05","01","09","07","0501","000002472 - MAPITUNARI                                                                                          "]
[null,null,null,null,null,null,null,null,null,null,null,null,null,null,"000002473","UNION ROSALES                                                                                       ","05","01","09","17","0501","000002473 - UNION ROSALES                                                                                       "]
[null,null,null,null,null,null,null,null,null,null,null,null,null,null,"000002474","SAMANIATO                                                                                           ","05","01","09","07","0501","000002474 - SAMANIATO                                                                                           "]
[null,null,null,null,null,null,null,null,null,null,null,null,null,null,"000002475","KIMBIRI ALTO                                                                                        ","05","01","09","07","0501","000002475 - KIMBIRI ALTO                                                                                        "]
[null,null,null,null,null,null,null,null,null,null,null,null,null,null,"000002479","VILLA VIRGEN                                                                                        ","05","01","09",12,"0501","000002479 - VILLA VIRGEN                                                                                        "]
[null,null,null,null,null,null,null,null,null,null,null,null,null,null,"000002488","VILLA QUINTIARINA                                                                                   ","05","01","09",13,"0501","000002488 - VILLA QUINTIARINA                                                                                   "]
[null,null,null,null,null,null,null,null,null,null,null,null,null,null,"000008283","PUEBLO LIBRE                                                                                        ","05","01","09","07","0501","000008283 - PUEBLO LIBRE                                                                                        "]
[null,null,null,null,null,null,null,null,null,null,null,null,null,null,"000008284","MANITEA ALTA                                                                                        ","05","01","09","17","0501","000008284 - MANITEA ALTA                                                                                        "]
[null,null,null,null,null,null,null,null,null,null,null,null,null,null,"000008285","ANGELES                                                                                             ","05","01","09","07","0501","000008285 - ANGELES                                                                                             "]
[null,null,null,null,null,null,null,null,null,null,null,null,null,null,"000024957","EJERCITO-LA OROYA 34                                                                                 ","05","01","09",12,"0501","000024957 - EJERCITO-LA OROYA 34                                                                                 "]
[null,null,null,null,null,null,null,null,null,null,null,null,null,null,"000000000","(All)","05","02",null,null,"0502","000000000 - (All)"]
[null,null,null,null,null,null,null,null,null,null,null,null,null,null,"000002494","PICHARI                                                                                             ","05","02","09","10","0502","000002494 - PICHARI                                                                                             "]
[null,null,null,null,null,null,null,null,null,null,null,null,null,null,"000002495","MANTARO                                                                                             ","05","02","09","18","0502","000002495 - MANTARO                                                                                             "]
[null,null,null,null,null,null,null,null,null,null,null,null,null,null,"000002496","OMAYA                                                                                               ","05","02","09","10","0502","000002496 - OMAYA                                                                                               "]
[null,null,null,null,null,null,null,null,null,null,null,null,null,null,"000002497","OTARI                                                                                               ","05","02","09","10","0502","000002497 - OTARI                                                                                               "]
[null,null,null,null,null,null,null,null,null,null,null,null,null,null,"000002498","PUERTO MAYO                                                                                         ","05","02","09","10","0502","000002498 - PUERTO MAYO                                                                                         "]
[null,null,null,null,null,null,null,null,null,null,null,null,null,null,"000007113","NATIVIDAD                                                                                           ","05","02","09","10","0502","000007113 - NATIVIDAD                                                                                           "]
[null,null,null,null,null,null,null,null,null,null,null,null,null,null,"000007114","QUISTO CENTRAL                                                                                      ","05","02","09","10","0502","000007114 - QUISTO CENTRAL                                                                                      "]
[null,null,null,null,null,null,null,null,null,null,null,null,null,null,"000015104","TAMBO DEL ENE                                                                                       ","05","02","09","10","0502","000015104 - TAMBO DEL ENE                                                                                       "]
[null,null,null,null,null,null,null,null,null,null,null,null,null,null,"000015169","PITIRINQUINI                                                                                        ","05","02","09","10","0502","000015169 - PITIRINQUINI                                                                                        "]
[null,null,null,null,null,null,null,null,null,null,null,null,null,null,"000015170","PICHARI BAJA                                                                                        ","05","02","09","10","0502","000015170 - PICHARI BAJA                                                                                        "]
[null,null,null,null,null,null,null,null,null,null,null,null,null,null,"000024638","EJERCITO-MILITAR PICHARI                                                                    ","05","02","09","10","0502","000024638 - EJERCITO-MILITAR PICHARI                                                                    "]
[null,null,null,null,null,null,null,null,null,null,null,null,null,null,"000027230","SANIDAD-PICHARI PNP                                                                            ","05","02","09","10","0502","000027230 - SANIDAD-PICHARI PNP                                                                            "]
[null,null,null,null,null,null,null,null,null,null,null,null,null,null,"000027948","ESSALUD-PICHARI                                                                       ","05","02","09","10","0502","000027948 - ESSALUD-PICHARI                                                                       "]
[null,null,null,null,null,null,null,null,null,null,null,null,null,null,"000032211","NUEVO PROGRESO                                                          ","05","02","09","10","0502","000032211 - NUEVO PROGRESO                                                          "]
[null,null,null,null,null,null,null,null,null,null,null,null,null,null,"000033988","MENTAL COMUNITARIO PICHARI","05","02","09","10","0502","000033988 - MENTAL COMUNITARIO PICHARI"]
[null,null,null,null,null,null,null,null,null,null,null,null,null,null,"999999999","(All)","05","99",null,null,"0599","999999999 - (All)"]
[null,null,null,null,null,null,null,null,null,null,null,null,null,null,"000002398","HOSPITAL SANTO TOMAS","06","00","07","01","0600","000002398 - HOSPITAL SANTO TOMAS"]
[null,null,null,null,null,null,null,null,null,null,null,null,null,null,"000000000","(All)","06","09",null,null,"0609","000000000 - (All)"]
[null,null,null,null,null,null,null,null,null,null,null,null,null,null,"000002399","PULPERA                                                                                             ","06","09","07","01","0609","000002399 - PULPERA                                                                                             "]
[null,null,null,null,null,null,null,null,null,null,null,null,null,null,"000002400","ALHUACCHULLO                                                                                        ","06","09","07","01","0609","000002400 - ALHUACCHULLO                                                                                        "]
[null,null,null,null,null,null,null,null,null,null,null,null,null,null,"000002401","CCAPACMARCA                                                                                         ","06","09","07","02","0609","000002401 - CCAPACMARCA                                                                                         "]
[null,null,null,null,null,null,null,null,null,null,null,null,null,null,"000002404","COLQUEMARCA                                                                                         ","06","09","07","04","0609","000002404 - COLQUEMARCA                                                                                         "]
[null,null,null,null,null,null,null,null,null,null,null,null,null,null,"000002405","CHARAMURAY                                                                                          ","06","09","07","04","0609","000002405 - CHARAMURAY                                                                                          "]
[null,null,null,null,null,null,null,null,null,null,null,null,null,null,"000002407","LLUSCO                                                                                              ","06","09","07","06",{"$f":"CONCATENATE(Q397,R397)","v":"0609"},"000002407 - LLUSCO                                                                                              "]
[null,null,null,null,null,null,null,null,null,null,null,null,null,null,"000002408","QUIÑOTA                                                                                             ","06","09","07","07","0609","000002408 - QUIÑOTA                                                                                             "]
[null,null,null,null,null,null,null,null,null,null,null,null,null,null,"000002409","VELILLE                                                                                             ","06","09","07","08","0609",{"$f":"CONCATENATE(O399,\" - \",P399)","v":"000002409 - VELILLE                                                                                             "}]
[null,null,null,null,null,null,null,null,null,null,null,null,null,null,"000006746","LLIQUE                                                                                              ","06","09","07","01","0609","000006746 - LLIQUE                                                                                              "]
[null,null,null,null,null,null,null,null,null,null,null,null,null,null,"000006747","LUTTO                                                                                               ","06","09","07","06","0609","000006747 - LUTTO                                                                                               "]
[null,null,null,null,null,null,null,null,null,null,null,null,null,null,"000006748","COLLPA                                                                                              ","06","09","07","06","0609","000006748 - COLLPA                                                                                              "]
[null,null,null,null,null,null,null,null,null,null,null,null,null,null,"000006981","CCOYO                                                                                               ","06","09","07","01","0609","000006981 - CCOYO                                                                                               "]
[null,null,null,null,null,null,null,null,null,null,null,null,null,null,"000006982","MELLOTOTORA                                                                                         ","06","09","07","01","0609","000006982 - MELLOTOTORA                                                                                         "]
[null,null,null,null,null,null,null,null,null,null,null,null,null,null,"000006983","ORCCOMA                                                                                             ","06","09","07","01","0609","000006983 - ORCCOMA                                                                                             "]
[null,null,null,null,null,null,null,null,null,null,null,null,null,null,"000006984","CCOLLANA                                                                                            ","06","09","07","07","0609","000006984 - CCOLLANA                                                                                            "]
[null,null,null,null,null,null,null,null,null,null,null,null,null,null,"000006985","TOTORAPALLCA                                                                                        ","06","09","07","06","0609","000006985 - TOTORAPALLCA                                                                                        "]
[null,null,null,null,null,null,null,null,null,null,null,null,null,null,"000007111","YAVINA                                                                                              ","06","09","07","01","0609","000007111 - YAVINA                                                                                              "]
[null,null,null,null,null,null,null,null,null,null,null,null,null,null,"000007112","YORENCCA                                                                                            ","06","09","07","07","0609","000007112 - YORENCCA                                                                                            "]
[null,null,null,null,null,null,null,null,null,null,null,null,null,null,"000008912","ALCCA VICTORIA                                                                                      ","06","09","07","08","0609","000008912 - ALCCA VICTORIA                                                                                      "]
[null,null,null,null,null,null,null,null,null,null,null,null,null,null,"000008913","HUARACO                                                                                             ","06","09","07","04","0609","000008913 - HUARACO                                                                                             "]
[null,null,null,null,null,null,null,null,null,null,null,null,null,null,"000008914","HUAYLLANI                                                                                           ","06","09","07","04","0609","000008914 - HUAYLLANI                                                                                           "]
[null,null,null,null,null,null,null,null,null,null,null,null,null,null,"000008915","PFULLPURI CONDEPAMPA                                                                                ","06","09","07","01","0609","000008915 - PFULLPURI CONDEPAMPA                                                                                "]
[null,null,null,null,null,null,null,null,null,null,null,null,null,null,"000009963","CANCAHUANI                                                                                          ","06","09","07","02","0609","000009963 - CANCAHUANI                                                                                          "]
[null,null,null,null,null,null,null,null,null,null,null,null,null,null,"000012932","YANQUE                                                                                              ","06","09","07","04","0609","000012932 - YANQUE                                                                                              "]
[null,null,null,null,null,null,null,null,null,null,null,null,null,null,"000013185","ESSALUD-SANTO TOMAS","06","09","07","01","0609","000013185 - ESSALUD-SANTO TOMAS"]
[null,null,null,null,null,null,null,null,null,null,null,null,null,null,"000025369","PUMALLACTA","06","09","07","07","0609","000025369 - PUMALLACTA"]
[null,null,null,null,null,null,null,null,null,null,null,null,null,null,"000025371","TUNTUMA","06","09","07","08","0609","000025371 - TUNTUMA"]
[null,null,null,null,null,null,null,null,null,null,null,null,null,null,"000027008","ANTUYO","06","09","07","06","0609","000027008 - ANTUYO"]
[null,null,null,null,null,null,null,null,null,null,null,null,null,null,"000027009","TAHUAY","06","09","07","02","0609","000027009 - TAHUAY"]
[null,null,null,null,null,null,null,null,null,null,null,null,null,null,"000027011","AYACCASI","06","09","07","08","0609","000027011 - AYACCASI"]
[null,null,null,null,null,null,null,null,null,null,null,null,null,null,"000027016","HUAYCUÑUTA - URCURUTA","06","09","07","08","0609","000027016 - HUAYCUÑUTA - URCURUTA"]
[null,null,null,null,null,null,null,null,null,null,null,null,null,null,"000030940","ARCANGEL SAN MIGUEL DE ESQUINA CONGUNYA","06","09","07","01","0609","000030940 - ARCANGEL SAN MIGUEL DE ESQUINA CONGUNYA"]
[null,null,null,null,null,null,null,null,null,null,null,null,null,null,"000000000","(All)","06","01",null,null,"0601","000000000 - (All)"]
[null,null,null,null,null,null,null,null,null,null,null,null,null,null,"000002402","CHAMACA                                                                                             ","06","01","07","03","0601","000002402 - CHAMACA                                                                                             "]
[null,null,null,null,null,null,null,null,null,null,null,null,null,null,"000002403","AÑAHUICHI                                                                                           ","06","01","07","03","0601","000002403 - AÑAHUICHI                                                                                           "]
[null,null,null,null,null,null,null,null,null,null,null,null,null,null,"000002406","LIVITACA                                                                                            ","06","01","07","05","0601","000002406 - LIVITACA                                                                                            "]
[null,null,null,null,null,null,null,null,null,null,null,null,null,null,"000016325","CHILLOROYA - LIVITACA                                                                               ","06","01","07","05","0601","000016325 - CHILLOROYA - LIVITACA                                                                               "]
[null,null,null,null,null,null,null,null,null,null,null,null,null,null,"000016327","AUSANTA                                                                                             ","06","01","07","05","0601","000016327 - AUSANTA                                                                                             "]
[null,null,null,null,null,null,null,null,null,null,null,null,null,null,"000016328","UCCHUCCARCCO                                                                                        ","06","01","07","03","0601","000016328 - UCCHUCCARCCO                                                                                        "]
[null,null,null,null,null,null,null,null,null,null,null,null,null,null,"000016329","INGATA                                                                                              ","06","01","07","03","0601","000016329 - INGATA                                                                                              "]
[null,null,null,null,null,null,null,null,null,null,null,null,null,null,"000016330","CCONCHACCOLLO                                                                                       ","06","01","07","03","0601","000016330 - CCONCHACCOLLO                                                                                       "]
[null,null,null,null,null,null,null,null,null,null,null,null,null,null,"000016332","PATAQUEÑA - LIVITACA","06","01","07","05","0601","000016332 - PATAQUEÑA - LIVITACA"]
[null,null,null,null,null,null,null,null,null,null,null,null,null,null,"000016334","KISIO                                                                                               ","06","01","07","05","0601","000016334 - KISIO                                                                                               "]
[null,null,null,null,null,null,null,null,null,null,null,null,null,null,"000025739","PISQUICOCHA","06","01","07","05","0601","000025739 - PISQUICOCHA"]
[null,null,null,null,null,null,null,null,null,null,null,null,null,null,"000025740","TOTORA - REYNA DE LOS ANGELES","06","01","07","05","0601","000025740 - TOTORA - REYNA DE LOS ANGELES"]
[null,null,null,null,null,null,null,null,null,null,null,null,null,null,"999999999","(All)","06","99",null,null,"0699",{"$f":"CONCATENATE(O437,\" - \",P437)","v":"999999999 - (All)"}]
[null,null,null,null,null,null,null,null,null,null,null,null,null,null,"999999999","(All)","99","99",null,null,"9999",{"$f":"CONCATENATE(O438,\" - \",P438)","v":"999999999 - (All)"}]

{"sheet":"TD","index":1,"n_rows":179,"n_cols":231,"rows_kept":179,"cut":false,"hidden":true,"merged":[[1,1,1,3]]}
[]
[null,"Datos",null,null,null,"Tabla",{"$f":"IF(F3=\"(Todas)\",\"CUSCO \",\"\")","v":""}]
[null,"RED","03 - LA CONVENCION",null,null,{"$f":"TRIM(MID(C3,5,90))","v":"LA CONVENCION"},{"$f":"IF(F3=\"(All)\",\" \",F3)","v":"LA CONVENCION"}]
[null,"Micro Red","0399 - (All)",null,null,{"$f":"TRIM(MID(C4,7,90))","v":"(All)"}," "]
[null,"Establecimiento","999999999 - (All)",null,null,{"$f":"TRIM(MID(C5,12,90))","v":"(All)"}," "]
[null,"Provincia","00 - (All)",null,null,{"$f":"TRIM(MID(C6,6,90))","v":"(All)"}," "]
[null,"Distrito","0000 - (All)",null,null,{"$f":"TRIM(MID(C7,8,90))","v":"(All)"}," "]
[null,"UE","7777 - (All)",null,null,{"$f":"TRIM(MID(C8,8,90))","v":"(All)"}," "]
[]
[null,"AÑO","2024"]
[null,"MESES",1,2,3,4,5,6,7,8,9,10,11,0]
[null,"Mes_desc",{"$f":"IF(C11=1,\"ENERO\",\"\")","v":"ENERO"},{"$f":"IF(D11=2,\"FEBRERO\",\"\")","v":"FEBRERO"},{"$f":"IF(E11=3,\"MARZO\",\"\")","v":"MARZO"},{"$f":"IF(F11=4,\"ABRIL\",\"\")","v":"ABRIL"},{"$f":"IF(G11=5,\"MAYO\",\"\")","v":"MAYO"},{"$f":"IF(H11=6,\"JUNIO\",\"\")","v":"JUNIO"},{"$f":"IF(I11=7,\"JULIO\",\"\")","v":"JULIO"},{"$f":"IF(J11=8,\"AGOSTO\",\"\")","v":"AGOSTO"},{"$f":"IF(K11=9,\"SETIEMBRE\",\"\")","v":"SETIEMBRE"},{"$f":"IF(L11=10,\"OCTUBRE\",\"\")","v":"OCTUBRE"},{"$f":"IF(M11=11,\"NOVIEMBRE\",\"\")","v":"NOVIEMBRE"},{"$f":"IF(N11=12,\"DICIEMBRE\",\"\")","v":""},{"$f":"IF(C11=1,C12,IF(D11=2,D12,IF(E11=3,E12,IF(F11=4,F12,IF(G11=5,G12,IF(H11=6,H12,IF(I11=7,I12,IF(J11=8,J12,IF(K11=9,K12,IF(L11=10,L12,IF(M11=11,M12,IF(N11=12,N12,\"\"))))))))))))","v":"ENERO"}]
[]
[null,"ACUMULADO",20,22,24,26,28,30,32,34,36,38,40,null,{"$f":"MIN(C14:N14)","v":20},{"$f":"MAX(C14:N14)","v":40}]
[null,"Mes_desc_Acu",{"$f":"IF(C14=20,\"ENERO\",\"\")","v":"ENERO"},{"$f":"IF(D14=22,\"FEBRERO\",\"\")","v":"FEBRERO"},{"$f":"IF(E14=24,\"MARZO\",\"\")","v":"MARZO"},{"$f":"IF(F14=26,\"ABRIL\",\"\")","v":"ABRIL"},{"$f":"IF(G14=28,\"MAYO\",\"\")","v":"MAYO"},{"$f":"IF(H14=30,\"JUNIO\",\"\")","v":"JUNIO"},{"$f":"IF(I14=32,\"JULIO\",\"\")","v":"JULIO"},{"$f":"IF(J14=34,\"AGOSTO\",\"\")","v":"AGOSTO"},{"$f":"IF(K14=36,\"SETIEMBRE\",\"\")","v":"SETIEMBRE"},{"$f":"IF(L14=38,\"OCTUBRE\",\"\")","v":"OCTUBRE"},{"$f":"IF(M14=40,\"NOVIEMBRE\",\"\")","v":"NOVIEMBRE"},{"$f":"IF(N14=42,\"DICIEMBRE\",\"\")","v":""},{"$f":"IF(O14=C14,C15,IF(O14=D14,D15,IF(O14=E14,E15,IF(O14=F14,F15,IF(O14=G14,G15,IF(O14=H14,H15,IF(O14=I14,I15,IF(O14=J14,J15,IF(O14=K14,K15,IF(O14=L14,L15,IF(O14=M14,M15,IF(O14=N14,N15,\"\"))))))))))))","v":"ENERO"},{"$f":"IF(P14=D14,D15,IF(P14=E14,E15,IF(P14=F14,F15,IF(P14=G14,G15,IF(P14=H14,H15,IF(P14=I14,I15,IF(P14=J14,J15,IF(P14=K14,K15,IF(P14=L14,L15,IF(P14=M14,M15,IF(P14=N14,N15,IF(P14=O14,O15,\"\"))))))))))))","v":"NOVIEMBRE"}]
[null,null,null,null,null,null,null,null,null,null,null,null,null,null,{"$f":"CONCATENATE(O15,\" - \",P15)","v":"ENERO - NOVIEMBRE"}]
[null,null,null,null,null,null,null,null,null,null,null,null,null,null,{"$f":"IF(O14=P14,O12,O16)","v":"ENERO - NOVIEMBRE"}]
[]
[]
[]
[]
[]
[]
[]
["Anio",2024]
["UE","(Todas)"]
["Red","LA CONVENCION"]
["MicroRed","(Todas)"]
["EESS","(Todas)"]
["Provincia","(Todas)"]
["Distrito","(Todas)"]
[]
["Etiquetas de fila"," BAS001"," BAS002"," BAS003"," BAS004"," BAS005"," BAS006"," BAS007"," BAS008"," BAS009"," BAS010"," BAS011"," BAS012"," BAS013"," BAS014"," BAS015"," BAS016"," BAS017"," BAS018"," BAS019"," BAS020"," BAS021"," BAS022"," BAS023"," BAS024"," BAS025"," BAS026"," BAS027"," BAS028"," BAS029"," BAS030"," BAS031"," BAS032"," BAS033"," BAS034"," BAS035"," BAS036"," BAS037"," BAS038"," BAS039"," BAS040"," BAS041"," BAS042"," BAS043"," BAS044"," BAS045"," BAS046"," BAS047"," BAS048"," BAS049"," BAS050"," BAS051"," BAS052"," BAS053"," BAS054"," BAS055"," BAS056"," BAS057"," BAS058"," BAS059"," BAS060"," BAS061"," BAS062"," BAS063"," BAS064"," BAS065"," BAS066"," BAS067"," BAS068"," BAS069"," BAS070"," BAS071"," BAS072"," BAS073"," BAS074"," BAS075"," BAS076"," BAS077"," BAS078"," BAS079"," BAS080"," BAS081"," BAS082"," BAS083"," BAS084"," BAS085"," BAS086"," BAS087"," BAS088"," BAS089"," BAS090"," BAS091"," BAS092"," BAS093"," BAS094"," BAS095"," BAS096"," BAS097"," BAS098"," BAS099"," BAS100"," BAS101"," BAS102"," BAS103"," BAS104"," BAS105"," BAS106"," BAS107"," BAS108"," BAS109"," BAS110"," BAS111"," BAS112"," BAS113"," BAS114"," BAS115"," BAS116"," BAS117"," BAS118"," BAS119"," BAS120"," BAS121"," BAS122"," BAS123"," BAS124"," BAS125"," BAS126"," BAS127"," BAS128"," BAS129"," BAS130"," BAS131"," BAS132"," BAS133"," BAS134"," BAS135"," BAS136"," BAS137"," BAS138"," BAS139"," BAS140"," BAS141"," BAS142"," BAS143"," BAS144"," BAS145"," BAS146"," BAS147"," BAS148"," BAS149"," BAS150"," BAS151"," BAS152"," BAS153"," BAS154"," BAS155"," BAS156"," BAS157"," BAS158"," BAS159"," BAS160"," BAS161"," BAS162"," BAS163"," BAS164"," BAS165"," BAS166"," BAS167"," BAS168"," BAS169"," BAS170"," BAS171"," BAS172"," BAS173"," BAS174"," BAS175"," BAS176"," BAS177"," BAS178"," BAS179"," BAS180"," BAS181"," BAS182"," BAS183"," BAS184"," BAS185"," BAS186"," BAS187"," BAS188"," BAS189"," BAS190"," BAS191"," BAS192"," BAS193"," BAS194"," BAS195"," BAS196"," BAS197"," BAS198"," BAS199"," BAS200"," BAS201"," BAS202"," BAS203"," BAS204"," BAS205"," BAS206"," BAS207"," BAS208"," BAS209"," BAS210"," BAS211"," BAS212"," BAS213"," BAS214"," BAS215"," BAS216"," BAS217"," BAS218"," BAS219"," BAS220"," BAS221"," BAS222"," BAS223"," BAS224"," BAS225"," BAS226"," BAS227"," BAS228"," BAS229"," BAS230"]
[1,284,45,158,417,186,1090,0,0,0,0,193,108,194,478,172,1145,187,105,193,475,172,1132,0,0,0,0,0,0,0,0,0,0,0,0,0,0,0,0,0,0,0,0,0,0,0,0,0,0,0,0,0,0,0,0,0,0,0,0,0,0,0,0,0,0,0,0,0,0,0,0,0,0,0,0,0,0,0,0,0,0,0,0,0,0,0,0,0,0,0,0,0,0,0,0,0,0,0,0,0,0,0,0,0,0,0,0,0,0,0,0,0,0,0,0,0,0,0,0,0,0,0,0,0,0,0,0,0,0,0,0,0,0,0,0,0,0,0,0,0,0,0,0,0,0,0,0,0,0,0,0,0,0,0,0,0,0,0,0,0,0,0,0,0,0,0,0,0,0,0,0,0,0,0,0,0,0,0,0,0,0,0,0,0,0,0,0,0,0,0,0,0,0,0,0,0,0,0,0,0,0,0,0,0,0,0,0,0,0,0,0,0,0,0,0,0,0,0,0,0,0,0,0,0,0,0,0,0,0,0,0]
[2,147,34,75,238,109,603,0,0,0,0,213,106,291,506,198,1314,213,106,291,505,198,1313,0,0,0,0,1,1,0,0,0,0,0,0,0,0,0,0,0,0,0,0,0,0,0,0,0,0,0,0,0,0,0,0,0,0,0,0,0,0,0,0,0,0,0,0,0,0,0,0,0,0,0,0,0,0,0,0,0,0,0,0,0,0,0,0,0,0,0,0,0,0,0,0,0,0,0,0,0,0,0,0,0,0,0,0,0,0,0,0,0,0,0,0,0,0,0,0,0,0,0,0,0,0,0,0,0,0,0,0,0,0,0,0,0,0,0,0,0,0,0,0,0,0,0,0,0,0,0,0,0,0,0,0,0,0,0,0,0,0,0,0,0,0,0,0,0,0,0,0,0,0,0,0,0,0,0,0,0,0,0,0,0,0,0,0,0,0,0,0,0,0,0,0,0,0,0,0,0,0,0,0,0,0,0,0,0,0,0,0,0,0,0,0,0,0,0,0,0,0,0,0,0,0,0,0,0,0,0,0]
[3,87,40,67,148,57,399,0,0,0,0,216,147,248,547,197,1355,216,147,247,547,196,1353,0,0,0,0,0,0,0,0,0,0,0,0,0,0,0,0,0,0,0,0,0,0,0,0,0,0,0,0,0,0,0,0,0,0,0,0,0,0,0,0,0,0,0,0,0,0,0,0,0,0,0,0,0,0,0,0,0,0,0,0,0,0,0,0,0,0,0,0,0,0,0,0,0,0,0,0,0,0,0,0,0,0,0,0,0,0,0,0,0,0,0,0,0,0,0,0,0,0,0,0,0,0,0,0,0,0,0,0,0,0,0,0,0,0,0,0,0,0,0,0,0,0,0,0,0,0,0,0,0,0,0,0,0,0,0,0,0,0,0,0,0,0,0,0,0,0,0,0,0,0,0,0,0,0,0,0,0,0,0,0,0,0,0,0,0,0,0,0,0,0,0,0,0,0,0,0,0,0,0,0,0,0,0,0,0,0,0,0,0,0,0,0,0,0,0,0,0,0,0,0,0,0,0,0,0,0,0,0]
[4,321,159,60,195,64,799,0,0,0,0,338,225,289,509,161,1522,335,225,286,506,161,1513,0,0,0,0,0,0,0,0,0,0,0,0,0,0,0,0,0,0,0,0,0,0,0,0,0,0,0,0,0,0,0,0,0,0,0,0,0,0,0,0,0,0,0,0,0,0,0,0,0,0,0,0,0,0,0,0,0,0,0,0,0,0,0,0,0,0,0,0,0,0,0,0,0,0,0,0,0,0,0,0,0,0,0,0,0,0,0,0,0,0,0,0,0,0,0,0,0,0,0,0,0,0,0,0,0,0,0,0,0,0,0,0,0,0,0,0,0,0,0,0,0,0,0,0,0,0,0,0,0,0,0,0,0,0,0,0,0,0,0,0,0,0,0,0,0,0,0,0,0,0,0,0,0,0,0,0,0,0,0,0,0,0,0,0,0,0,0,0,0,0,0,0,0,0,0,0,0,0,0,0,0,0,0,0,0,0,0,0,0,0,0,0,0,0,0,0,0,0,0,0,0,0,0,0,0,0,0,0]
[5,28,45,46,92,61,272,0,0,0,0,415,243,276,492,159,1585,413,243,276,492,159,1583,0,0,0,0,0,0,0,0,0,0,0,0,0,0,0,0,0,0,0,0,0,0,0,0,0,0,0,0,0,0,0,0,0,0,0,0,0,0,0,0,0,0,0,0,0,0,0,0,0,0,0,0,0,0,0,0,0,0,0,0,0,0,0,0,0,0,0,0,0,0,0,0,0,0,0,0,0,0,0,0,0,0,0,0,0,0,0,0,0,0,0,0,0,0,0,0,0,0,0,0,0,0,0,0,0,0,1,0,0,0,0,0,1,0,0,0,0,0,0,0,0,0,0,0,0,0,0,0,0,0,0,0,0,0,0,0,0,0,0,0,0,0,0,0,0,0,0,0,0,0,0,0,0,0,0,0,0,0,0,0,0,0,0,0,0,0,0,0,0,0,0,0,0,0,0,0,0,0,0,0,0,0,0,0,0,0,0,0,0,0,0,0,0,0,0,0,0,0,0,0,0,0,0,0,0,0,0,0]
[6,29,11,29,87,34,190,0,0,0,0,307,170,235,448,173,1333,304,168,232,443,173,1320,0,0,0,0,0,0,0,0,0,0,0,0,0,0,0,0,0,0,0,0,0,0,0,0,0,0,0,0,0,0,0,0,0,0,0,0,0,0,0,0,0,0,0,0,0,0,0,0,0,0,0,0,0,0,0,0,0,0,0,0,0,0,0,0,0,0,0,0,0,0,0,0,0,0,0,0,0,0,0,0,0,0,0,0,0,0,0,0,0,0,0,0,0,0,0,0,0,0,0,0,0,0,0,0,0,0,0,1,2,6,0,0,0,0,1,8,0,0,0,0,0,0,0,0,0,0,0,0,0,0,0,0,0,0,0,0,0,0,0,0,0,0,0,0,0,0,0,0,0,0,0,0,0,0,0,0,0,0,0,0,0,0,0,0,0,0,0,0,0,0,0,0,0,0,0,0,0,0,0,0,0,0,0,0,0,0,0,0,0,0,0,0,0,0,0,0,0,0,0,0,0,0,0,0,0,0,0,0]
[7,6,6,28,53,13,106,0,0,0,0,264,97,159,434,135,1089,264,97,158,433,135,1087,0,0,0,0,0,0,0,0,0,0,0,0,0,0,0,0,0,0,0,0,0,0,0,0,0,0,0,0,0,0,0,0,0,0,0,0,0,0,0,0,0,0,0,0,0,0,0,0,0,0,0,0,0,0,0,0,0,0,0,0,0,0,0,0,0,0,0,0,0,0,0,0,0,0,0,0,0,0,0,0,0,0,0,0,0,0,0,0,0,0,0,0,0,0,0,0,0,0,0,0,0,0,0,0,0,0,0,0,0,1,0,0,0,0,0,1,0,0,0,0,0,0,0,0,0,0,0,0,0,0,0,0,0,0,0,0,0,0,0,0,0,0,0,0,0,0,0,0,0,0,0,0,0,0,0,0,0,0,0,0,0,0,0,0,0,0,0,0,0,0,0,0,0,0,0,0,0,0,0,0,0,0,0,0,0,0,0,0,0,0,0,0,0,0,0,0,0,0,0,0,0,0,0,0,0,0,0,0]
[8,8,3,21,25,10,67,0,0,0,0,197,81,195,389,138,1000,197,80,194,389,137,997,0,0,0,0,0,0,0,0,0,0,0,0,0,0,0,0,0,0,0,0,0,0,0,0,0,0,0,0,0,0,0,0,0,0,0,0,0,0,0,0,0,0,0,0,0,0,0,0,0,0,0,0,0,0,0,0,0,0,0,0,0,0,0,0,0,0,0,0,0,0,0,0,0,0,0,0,0,0,0,0,0,0,0,0,0,0,0,0,0,0,0,0,0,0,0,0,0,0,0,0,0,0,0,0,0,0,0,0,2,1,0,0,0,0,0,3,0,0,0,0,0,0,0,0,0,0,0,0,0,0,0,0,0,0,0,0,0,0,0,0,0,0,0,0,0,0,0,0,0,0,0,0,0,0,0,0,0,0,0,0,0,0,0,0,0,0,0,0,0,0,0,0,0,0,0,0,0,0,0,0,0,0,0,0,0,0,0,0,0,0,0,0,0,0,0,0,0,0,0,0,0,0,0,0,0,0,0,0]
[11,4,4,15,21,11,55,0,0,0,0,246,106,198,473,205,1228,245,103,194,452,200,1194,0,0,0,0,0,0,0,0,0,0,0,0,0,0,0,0,0,0,0,0,0,4,0,4,0,0,0,0,0,0,0,0,0,0,0,0,0,0,0,0,0,0,0,0,0,0,0,0,0,0,0,0,0,0,0,0,0,0,0,0,0,0,0,0,0,0,0,0,0,1,0,0,0,0,0,1,0,0,0,0,0,0,0,0,0,0,0,0,0,0,0,0,0,0,0,0,0,0,0,0,0,0,0,0,0,0,0,1,1,7,2,0,0,1,0,8,0,0,0,0,0,0,0,0,0,0,0,0,0,0,0,0,0,0,0,0,0,0,0,0,0,0,0,0,0,0,0,0,0,0,0,0,0,0,0,0,0,0,0,0,0,0,0,0,0,0,0,0,0,0,0,0,0,0,0,0,0,0,0,0,0,0,0,0,0,0,0,0,0,0,0,0,0,0,0,0,0,0,0,0,0,0,0,0,0,0,0,0]
[9,5,8,12,31,10,66,0,0,0,0,142,76,154,361,168,901,142,75,150,358,164,889,0,0,0,0,0,0,0,0,0,0,0,0,0,0,0,0,0,0,0,0,0,0,0,0,0,0,0,0,0,0,0,0,0,0,0,0,0,0,0,0,0,0,0,0,0,0,0,0,0,0,0,0,0,0,0,0,0,0,0,0,0,0,0,0,0,0,0,0,0,0,0,0,0,0,0,0,0,0,0,0,0,0,0,0,0,0,0,0,0,0,0,0,0,0,0,0,0,0,0,0,0,0,0,0,0,0,0,1,1,3,0,0,0,0,1,4,0,0,0,0,0,0,0,0,0,0,0,0,0,0,0,0,0,0,0,0,0,0,0,0,0,0,0,0,0,0,0,0,0,0,0,0,0,0,0,0,0,0,0,0,0,0,0,0,0,0,0,0,0,0,0,0,0,0,0,0,0,0,0,0,0,0,0,0,0,0,0,0,0,0,0,0,0,0,0,0,0,0,0,0,0,0,0,0,0,0,0,0]
[10,5,6,9,42,10,72,0,0,0,0,205,93,164,470,161,1093,202,92,163,466,159,1082,0,0,0,0,0,0,0,0,0,0,0,0,0,0,0,0,0,0,0,0,0,0,0,0,0,0,0,0,0,0,0,0,0,0,0,0,0,0,0,0,0,0,0,0,0,0,0,0,0,0,0,0,0,0,0,0,0,0,0,0,0,0,0,0,0,0,0,0,0,0,0,0,0,0,0,0,0,0,0,0,0,0,0,0,0,0,0,0,0,0,0,0,0,0,0,0,0,0,0,0,0,0,0,0,0,0,0,0,2,4,0,0,0,0,0,6,0,0,0,0,0,0,0,0,0,0,0,0,0,0,0,0,0,0,0,0,0,0,0,0,0,0,0,0,0,0,0,0,0,0,0,0,0,0,0,0,0,0,0,0,0,0,0,0,0,0,0,0,0,0,0,0,0,0,0,0,0,0,0,0,0,0,0,0,0,0,0,0,0,0,0,0,0,0,0,0,0,0,0,0,0,0,0,0,0,0,0,0]
["Total general",924,361,520,1349,565,3719,0,0,0,0,2736,1452,2403,5107,1867,13565,2718,1441,2384,5066,1854,13463,0,0,0,0,1,1,0,0,0,0,0,0,0,0,0,0,0,0,0,0,0,4,0,4,0,0,0,0,0,0,0,0,0,0,0,0,0,0,0,0,0,0,0,0,0,0,0,0,0,0,0,0,0,0,0,0,0,0,0,0,0,0,0,0,0,0,0,0,0,1,0,0,0,0,0,1,0,0,0,0,0,0,0,0,0,0,0,0,0,0,0,0,0,0,0,0,0,0,0,0,0,0,0,0,0,0,1,3,8,22,2,0,1,1,2,30,0,0,0,0,0,0,0,0,0,0,0,0,0,0,0,0,0,0,0,0,0,0,0,0,0,0,0,0,0,0,0,0,0,0,0,0,0,0,0,0,0,0,0,0,0,0,0,0,0,0,0,0,0,0,0,0,0,0,0,0,0,0,0,0,0,0,0,0,0,0,0,0,0,0,0,0,0,0,0,0,0,0,0,0,0,0,0,0,0,0,0,0]
[]
[]
[]
[]
["Anio",2024]
["Red","LA CONVENCION"]
["UE","(Todas)"]
["MicroRed","(Todas)"]
["EESS","(Todas)"]
["Provincia","(Todas)"]
["Distrito","(Todas)"]
[]
["Etiquetas de fila"," BAS001"," BAS002"," BAS003"," BAS004"," BAS005"," BAS006"," BAS007"," BAS008"," BAS009"," BAS010"," BAS011"," BAS012"," BAS013"," BAS014"," BAS015"," BAS016"," BAS017"," BAS018"," BAS019"," BAS020"," BAS021"," BAS022"," BAS023"," BAS024"," BAS025"," BAS026"," BAS027"," BAS028"," BAS029"," BAS030"," BAS031"," BAS032"," BAS033"," BAS034"," BAS035"," BAS036"," BAS037"," BAS038"," BAS039"," BAS040"," BAS041"," BAS042"," BAS043"," BAS044"," BAS045"," BAS046"," BAS047"," BAS048"," BAS049"," BAS050"," BAS051"," BAS052"," BAS053"," BAS054"," BAS055"," BAS056"," BAS057"," BAS058"," BAS059"," BAS060"," BAS061"," BAS062"," BAS063"," BAS064"," BAS065"," BAS066"," BAS067"," BAS068"," BAS069"," BAS070"," BAS071"," BAS072"," BAS073"," BAS074"," BAS075"," BAS076"," BAS077"," BAS078"," BAS079"," BAS080"," BAS081"," BAS082"," BAS083"," BAS084"," BAS085"," BAS086"," BAS087"," BAS088"," BAS089"," BAS090"," BAS091"," BAS092"," BAS093"," BAS094"," BAS095"," BAS096"," BAS097"," BAS098"," BAS099"," BAS100"," BAS101"," BAS102"," BAS103"," BAS104"," BAS105"," BAS106"," BAS107"," BAS108"," BAS109"," BAS110"," BAS111"," BAS112"," BAS113"," BAS114"," BAS115"," BAS116"," BAS117"," BAS118"," BAS119"," BAS120"," BAS121"," BAS122"," BAS123"," BAS124"," BAS125"," BAS126"," BAS127"," BAS128"," BAS129"," BAS130"," BAS131"," BAS132"," BAS133"," BAS134"," BAS135"," BAS136"," BAS137"," BAS138"," BAS139"," BAS140"," BAS141"," BAS142"," BAS143"," BAS144"," BAS145"," BAS146"," BAS147"," BAS148"," BAS149"," BAS150"," BAS151"," BAS152"," BAS153"," BAS154"," BAS155"," BAS156"," BAS157"," BAS158"," BAS159"," BAS160"," BAS161"," BAS162"," BAS163"," BAS164"," BAS165"," BAS166"," BAS167"," BAS168"," BAS169"," BAS170"," BAS171"," BAS172"," BAS173"," BAS174"," BAS175"," BAS176"," BAS177"," BAS178"," BAS179"," BAS180"," BAS181"," BAS182"," BAS183"," BAS184"," BAS185"," BAS186"," BAS187"," BAS188"," BAS189"," BAS190"," BAS191"," BAS192"," BAS193"," BAS194"," BAS195"," BAS196"," BAS197"," BAS198"," BAS199"," BAS200"," BAS201"," BAS202"," BAS203"," BAS204"," BAS205"," BAS206"," BAS207"," BAS208"," BAS209"," BAS210"," BAS211"," BAS212"," BAS213"," BAS214"," BAS215"," BAS216"," BAS217"," BAS218"," BAS219"," BAS220"," BAS221"," BAS222"," BAS223"," BAS224"," BAS225"," BAS226"," BAS227"," BAS228"," BAS229"," BAS230"]
[1,284,45,158,417,186,1090,0,0,0,0,4,9,20,50,8,91,4,8,14,27,5,58,0,0,0,0,0,0,0,0,3,14,3,20,0,0,0,0,0,0,1,0,1,2,1,0,1,0,0,3,0,0,0,0,0,0,0,0,0,0,0,0,0,0,0,0,0,0,0,0,0,0,1,0,0,0,0,0,1,0,0,0,0,0,0,0,0,0,0,0,0,0,0,0,0,0,0,0,0,0,0,0,0,0,0,0,0,0,0,0,0,0,0,0,0,0,0,0,0,0,0,0,0,0,0,0,0,0,0,0,0,0,0,0,0,0,0,0,0,0,0,0,0,0,0,0,0,0,0,0,0,0,0,0,0,0,0,0,0,0,0,0,0,0,0,0,0,0,0,0,0,0,0,0,0,0,0,0,0,0,0,0,0,0,0,0,0,0,0,0,0,0,0,0,0,0,0,0,0,0,0,0,0,0,0,0,0,0,0,0,0,0,0,0,0,0,0,0,0,0,0,0,0,0,0,0,0,0,0,0]
[2,147,34,75,238,109,603,0,0,0,0,5,8,11,37,12,73,3,5,7,15,6,36,0,0,0,0,0,0,1,2,1,8,1,13,0,0,0,0,0,0,0,0,0,3,1,0,0,0,0,3,0,0,0,0,0,0,0,0,0,0,0,0,0,0,0,0,0,0,0,0,0,1,2,1,0,0,0,0,3,0,0,0,0,0,0,0,0,0,0,0,0,0,0,0,0,0,0,0,0,0,0,0,0,0,0,0,0,0,0,0,0,0,1,0,0,0,0,0,1,0,0,0,0,0,0,0,0,0,0,0,0,0,0,0,0,0,0,0,0,0,0,0,0,0,0,0,0,0,0,0,0,0,0,0,0,0,0,0,0,0,0,0,0,0,0,0,0,0,0,0,0,0,0,0,0,0,0,0,0,0,0,0,0,0,0,0,0,0,0,0,0,0,0,0,0,0,0,0,0,0,0,0,0,0,0,0,0,0,0,0,0,0,0,0,0,0,0,0,0,0,0,0,0,0,0,0,0,0,0,0]
[3,87,40,67,148,57,399,0,0,0,0,4,4,16,28,16,68,1,4,7,13,5,30,0,0,0,0,0,0,1,0,1,8,5,15,0,0,0,0,0,0,0,0,0,0,2,0,0,0,0,0,0,0,0,0,0,0,0,0,0,0,0,0,0,0,0,0,0,0,0,1,1,0,1,0,0,1,1,0,1,0,0,0,1,0,0,0,0,0,1,0,0,0,0,0,0,0,0,0,0,0,0,0,0,0,0,0,0,0,0,0,0,0,1,0,0,0,0,0,1,0,0,0,0,0,0,0,0,0,0,0,0,0,0,0,0,0,0,0,0,0,0,0,0,0,0,0,0,0,0,0,0,0,0,0,0,0,0,0,0,0,0,0,0,0,0,0,0,0,0,0,0,0,0,0,0,0,0,0,0,0,0,0,0,0,0,0,0,0,0,0,0,0,0,0,0,0,0,0,0,0,0,0,0,0,0,0,0,0,0,0,0,0,0,0,0,0,0,0,0,0,0,0,0,0,0,0,0,0,0,0]
[4,321,159,60,195,64,799,0,0,0,0,17,3,16,45,26,107,8,2,5,19,7,41,0,0,0,0,0,0,3,0,6,9,7,25,0,0,0,0,0,0,1,0,0,3,0,0,1,0,0,3,0,0,0,0,0,0,0,0,0,0,0,0,0,0,0,0,0,0,0,1,0,0,1,1,0,1,0,0,1,0,0,0,0,0,0,0,0,0,0,0,0,0,0,0,0,0,0,0,0,0,0,0,0,0,0,0,0,0,0,0,0,1,0,0,0,0,0,0,1,0,0,0,0,0,0,0,0,0,0,0,0,0,0,0,0,0,0,0,0,0,0,0,0,0,0,0,0,0,0,0,0,0,0,0,0,0,0,0,0,0,0,0,0,0,0,0,0,0,0,0,0,0,0,0,0,0,0,0,0,0,0,0,0,0,0,0,0,0,0,0,0,0,0,0,0,0,0,0,0,0,0,0,0,2,0,0,0,0,0,0,0,0,0,0,0,0,0,0,0,0,0,0,0,0,0,0,0,0,0,0]
[5,28,45,46,92,61,272,0,0,0,0,8,3,15,50,11,87,5,2,5,20,4,36,0,0,0,0,0,0,3,0,5,9,2,19,0,0,0,0,0,0,0,1,2,3,1,0,0,1,0,5,0,0,0,0,0,0,0,0,0,0,0,0,0,0,0,0,0,0,0,2,1,0,1,0,0,1,2,0,1,0,0,0,0,0,0,0,0,0,0,0,0,0,0,0,0,0,0,0,0,0,0,0,0,0,0,0,0,0,0,0,0,0,1,0,0,0,0,0,1,0,0,0,0,0,0,0,0,0,0,0,0,0,0,0,0,0,0,0,0,0,0,0,0,0,0,0,0,0,0,0,0,0,0,0,0,0,0,0,0,0,0,0,0,0,0,0,0,0,0,0,0,0,0,0,0,0,0,0,0,0,0,0,0,0,0,0,0,0,0,1,1,1,0,0,0,0,1,1,1,3,0,0,1,2,0,2,1,0,1,0,0,0,0,0,0,0,0,0,0,0,0,0,0,0,0,0,0,0,0,0]
[6,29,11,29,87,34,190,0,0,0,0,13,0,14,24,24,75,11,0,10,10,7,38,0,0,0,0,0,0,0,0,1,7,6,14,0,0,0,1,0,1,1,0,2,1,1,0,1,0,2,1,0,0,0,0,0,0,0,0,0,0,0,0,1,0,0,0,0,0,1,1,0,0,0,1,0,1,0,0,0,0,0,0,0,0,0,0,0,0,0,0,0,0,0,0,0,0,0,0,0,0,0,0,0,0,0,0,0,0,0,0,0,0,0,0,0,0,0,0,0,0,0,0,0,0,0,0,0,0,0,0,0,0,0,0,0,0,0,0,0,0,0,0,0,0,0,0,0,0,0,0,0,0,0,0,0,0,0,0,0,0,0,0,0,0,0,0,0,0,0,0,0,0,0,0,0,0,0,0,0,0,0,0,0,0,0,0,0,0,0,0,0,0,0,0,0,0,0,0,0,15,1,3,5,2,0,5,10,3,8,1,0,2,6,1,0,0,1,0,8,0,0,0,0,0,0,0,0,0,0,0]
[7,6,6,28,53,13,106,0,0,0,0,19,6,8,49,21,103,11,5,5,21,3,45,0,0,0,0,0,0,2,0,1,8,8,19,0,0,0,0,0,0,1,0,0,2,0,0,1,0,0,2,0,0,0,0,0,0,0,0,0,0,0,0,0,0,0,0,0,0,0,0,0,0,0,0,0,0,0,0,0,0,0,0,0,0,0,0,0,0,0,0,0,0,0,0,0,0,0,0,0,0,0,0,0,0,0,0,0,0,0,0,0,0,0,0,0,0,0,0,0,0,0,0,0,0,0,0,0,0,0,0,0,0,0,0,0,0,0,0,0,0,0,0,0,0,0,0,0,0,0,0,0,0,0,0,0,0,0,0,0,0,0,0,0,0,0,0,0,0,0,0,0,0,0,0,0,0,0,0,0,0,0,0,0,0,0,0,0,0,0,0,0,0,0,0,0,0,0,0,0,1,0,1,0,1,0,1,0,0,1,0,0,0,0,0,0,0,0,0,0,0,0,0,0,0,0,0,0,0,0,0]
[8,8,3,21,25,10,67,0,0,0,0,9,2,15,48,29,103,4,2,6,18,7,37,0,0,0,0,0,0,1,0,2,8,5,16,0,0,0,0,0,0,0,0,2,1,2,0,0,0,1,2,0,0,0,0,0,0,0,0,0,0,0,0,0,0,0,0,0,0,0,0,0,0,1,1,0,0,0,0,1,0,0,0,0,0,0,0,0,0,0,0,0,0,0,0,0,0,0,0,0,0,0,0,0,0,0,0,0,0,0,0,0,0,0,0,0,0,0,0,0,0,0,0,0,0,0,0,0,0,0,0,0,0,0,0,0,0,0,0,0,0,0,0,0,0,0,0,0,0,0,0,0,0,0,0,0,0,0,0,0,0,0,0,0,0,0,0,0,0,0,0,0,0,0,0,0,0,0,0,0,0,0,0,0,0,0,0,0,0,0,0,0,0,0,0,0,0,0,0,0,5,0,4,13,2,0,4,1,1,16,0,0,0,0,0,0,0,0,0,0,0,0,0,0,0,0,0,0,0,0,0]
[11,4,4,15,21,11,55,0,0,0,0,4,6,6,20,9,45,4,3,4,10,6,27,0,0,0,0,0,0,0,1,0,1,1,3,0,0,0,0,0,0,1,1,2,1,0,0,1,1,1,2,0,0,0,0,0,0,0,0,0,0,0,0,0,0,0,0,0,0,0,0,0,0,1,0,0,0,0,0,1,0,0,0,0,0,0,0,0,0,0,0,0,0,0,0,0,0,0,0,0,0,0,0,0,0,0,0,0,0,0,0,0,0,0,0,0,0,0,0,0,0,0,0,0,0,0,0,0,0,0,0,0,0,0,0,0,0,0,0,0,0,0,0,0,0,0,0,0,0,0,0,0,0,0,0,0,0,0,0,0,1,0,0,0,0,0,1,0,0,0,0,0,0,0,0,0,0,0,0,0,0,0,0,0,0,0,0,0,0,0,0,0,0,0,0,0,0,0,0,0,1,0,0,1,0,0,1,0,0,1,0,0,0,0,0,0,0,0,0,0,0,0,0,0,0,0,0,0,0,0,0]
[9,5,8,12,31,10,66,0,0,0,0,14,9,13,36,13,85,9,3,6,15,7,40,0,0,0,0,0,0,1,2,3,8,3,17,0,0,0,0,0,0,4,0,0,0,2,0,2,2,0,0,0,0,0,0,0,0,0,0,0,0,0,0,0,0,0,0,0,0,0,0,0,0,0,0,0,0,0,0,0,0,0,0,0,0,0,0,0,0,0,0,0,0,0,0,0,0,0,0,0,0,0,0,0,0,0,0,0,0,0,0,0,0,0,0,0,0,0,0,0,0,0,0,0,0,0,0,0,0,0,0,0,0,0,0,0,0,0,0,0,0,0,0,0,0,0,0,0,0,0,0,0,0,0,0,0,0,0,0,0,0,0,0,0,0,0,0,0,0,0,0,0,0,0,0,0,0,0,0,0,0,0,0,0,0,0,0,0,0,0,0,0,0,0,0,0,0,0,0,0,1,1,5,5,2,0,0,1,3,8,0,0,0,1,0,0,0,0,0,1,0,0,0,0,0,0,0,0,0,0,0]
[10,5,6,9,42,10,72,0,0,0,0,14,7,10,39,11,81,9,4,3,13,3,32,0,0,0,0,0,0,3,1,2,8,0,14,0,0,0,0,0,0,0,1,0,3,0,0,0,0,1,3,0,0,0,0,0,0,0,0,0,0,0,0,0,0,0,0,0,0,0,0,0,0,0,0,0,0,0,0,0,0,0,0,0,0,0,0,0,0,0,0,0,0,0,0,0,0,0,0,0,0,0,0,0,0,0,0,0,0,0,0,0,0,0,0,0,0,0,0,0,0,0,0,0,0,0,0,0,0,0,0,0,0,0,0,0,0,0,0,0,0,0,0,0,0,0,0,0,0,0,0,0,0,0,0,0,0,0,0,0,0,0,0,0,0,0,0,0,0,0,0,0,0,0,0,0,0,0,0,0,0,0,0,0,0,0,0,0,0,0,0,0,0,0,0,0,0,0,0,0,2,1,0,4,2,0,1,1,1,4,0,0,0,0,0,0,0,0,0,0,0,0,0,0,0,0,0,0,0,0,0]
["Total general",924,361,520,1349,565,3719,0,0,0,0,111,57,144,426,180,918,69,38,72,181,60,420,0,0,0,0,0,0,15,6,25,88,41,175,0,0,0,1,0,1,9,3,9,19,10,0,7,4,5,24,0,0,0,0,0,0,0,0,0,0,0,0,1,0,0,0,0,0,1,5,2,1,8,4,0,4,3,0,9,0,0,0,1,0,0,0,0,0,1,0,0,0,0,0,0,0,0,0,0,0,0,0,0,0,0,0,0,0,0,0,0,1,3,0,0,0,0,0,4,0,0,0,0,0,0,0,0,0,0,0,0,0,0,0,0,0,0,0,0,0,0,0,0,0,0,0,0,0,0,0,0,0,0,0,0,0,0,0,0,1,0,0,0,0,0,1,0,0,0,0,0,0,0,0,0,0,0,0,0,0,0,0,0,0,0,0,0,0,0,1,1,1,0,0,0,0,1,1,1,28,3,13,29,13,0,14,14,8,39,1,0,2,7,1,0,0,1,0,9,0,0,0,0,0,0,0,0,0,0,0]
[]
[]
[]
[]
[]
[]
[]
[]
[]
[]
[]
[]
[]
[]
[]
[]
[]
[]
[]
[]
[]
[]
[]
[]
[]
[]
[]
[]
[]
[]
[]
[]
[]
[]
[]
[]
[]
[]
[]
[]
[]
[]
[]
["Anio",2024]
["UE","(Todas)"]
["Red","LA CONVENCION"]
["MicroRed","(Todas)"]
["EESS","(Todas)"]
["Provincia","(Todas)"]
["Distrito","(Todas)"]
[]
["Etiquetas de fila"," BAS001"," BAS002"," BAS003"," BAS004"," BAS005"," BAS006"," BAS007"," BAS008"," BAS009"," BAS010"," BAS011"," BAS012"," BAS013"," BAS014"," BAS015"," BAS016"," BAS017"," BAS018"," BAS019"," BAS020"," BAS021"," BAS022"," BAS023"," BAS024"," BAS025"," BAS026"," BAS027"," BAS028"," BAS029"," BAS030"," BAS031"," BAS032"," BAS033"," BAS034"," BAS035"," BAS036"," BAS037"," BAS038"," BAS039"," BAS040"," BAS041"," BAS042"," BAS043"," BAS044"," BAS045"," BAS046"," BAS047"," BAS048"," BAS049"," BAS050"," BAS051"," BAS052"," BAS053"," BAS054"," BAS055"," BAS056"," BAS057"," BAS058"," BAS059"," BAS060"," BAS061"," BAS062"," BAS063"," BAS064"," BAS065"," BAS066"," BAS067"," BAS068"," BAS069"," BAS070"," BAS071"," BAS072"," BAS073"," BAS074"," BAS075"," BAS076"," BAS077"," BAS078"," BAS079"," BAS080"," BAS081"," BAS082"," BAS083"," BAS084"," BAS085"," BAS086"," BAS087"," BAS088"," BAS089"," BAS090"," BAS091"," BAS092"," BAS093"," BAS094"," BAS095"," BAS096"," BAS097"," BAS098"," BAS099"," BAS100"," BAS101"," BAS102"," BAS103"," BAS104"," BAS105"," BAS106"," BAS107"," BAS108"," BAS109"," BAS110"," BAS111"," BAS112"," BAS113"," BAS114"," BAS115"," BAS116"," BAS117"," BAS118"," BAS119"," BAS120"," BAS121"," BAS122"," BAS123"," BAS124"," BAS125"," BAS126"," BAS127"," BAS128"," BAS129"," BAS130"," BAS131"," BAS132"," BAS133"," BAS134"," BAS135"," BAS136"," BAS137"," BAS138"," BAS139"," BAS140"," BAS141"," BAS142"," BAS143"," BAS144"," BAS145"," BAS146"," BAS147"," BAS148"," BAS149"," BAS150"," BAS151"," BAS152"," BAS153"," BAS154"," BAS155"," BAS156"," BAS157"," BAS158"," BAS159"," BAS160"," BAS161"," BAS162"," BAS163"," BAS164"," BAS165"," BAS166"," BAS167"," BAS168"," BAS169"," BAS170"," BAS171"," BAS172"," BAS173"," BAS174"," BAS175"," BAS176"," BAS177"," BAS178"," BAS179"," BAS180"," BAS181"," BAS182"," BAS183"," BAS184"," BAS185"," BAS186"," BAS187"," BAS188"," BAS189"," BAS190"," BAS191"," BAS192"," BAS193"," BAS194"," BAS195"," BAS196"," BAS197"," BAS198"," BAS199"," BAS200"," BAS201"," BAS202"," BAS203"," BAS204"," BAS205"," BAS206"," BAS207"," BAS208"," BAS209"," BAS210"," BAS211"," BAS212"," BAS213"," BAS214"," BAS215"," BAS216"," BAS217"," BAS218"," BAS219"," BAS220"," BAS221"," BAS222"," BAS223"," BAS224"," BAS225"," BAS226"," BAS227"," BAS228"," BAS229"," BAS230"]
[1,284,45,158,417,186,1090,0,0,0,0,9,13,22,45,9,98,9,13,22,45,9,98,0,0,0,0,0,0,0,0,0,0,0,0,0,0,0,0,0,0,0,0,0,0,0,0,0,0,0,0,0,0,0,0,0,0,0,0,0,0,0,0,0,0,0,0,0,0,0,0,0,0,0,0,0,0,0,0,0,0,0,0,0,0,0,0,0,0,0,0,0,0,0,0,0,0,0,0,0,0,0,0,0,0,0,0,0,0,0,0,0,0,0,0,0,0,0,0,0,0,0,0,0,0,0,0,0,0,0,0,0,0,0,0,0,0,0,0,0,0,0,0,0,0,0,0,0,0,0,0,0,0,0,0,0,0,0,0,0,0,0,0,0,0,0,0,0,0,0,0,0,0,0,0,0,0,0,0,0,0,0,0,0,0,0,0,0,0,0,0,0,0,0,0,0,0,0,0,0,0,0,0,0,0,0,0,0,0,0,0,0,0,0,0,0,0,0,0,0,0,0,0,0,0,0,0,0,0,0,0]
[2,147,34,75,238,109,603,0,0,0,0,21,13,45,43,5,127,21,13,45,43,5,127,0,0,0,0,0,0,0,0,0,0,0,0,0,0,0,0,0,0,0,0,0,0,0,0,0,0,0,0,0,0,0,0,0,0,0,0,0,0,0,0,0,0,0,0,0,0,0,0,0,0,0,0,0,0,0,0,0,0,0,0,0,0,0,0,0,0,0,0,0,0,0,0,0,0,0,0,0,0,0,0,0,0,0,0,0,0,0,0,0,0,0,0,0,0,0,0,0,0,0,0,0,0,0,0,0,0,0,0,0,0,0,0,0,0,0,0,0,0,0,0,0,0,0,0,0,0,0,0,0,0,0,0,0,0,0,0,0,0,0,0,0,0,0,0,0,0,0,0,0,0,0,0,0,0,0,0,0,0,0,0,0,0,0,0,0,0,0,0,0,0,0,0,0,0,0,0,0,0,0,0,0,0,0,0,0,0,0,0,0,0,0,0,0,0,0,0,0,0,0,0,0,0,0,0,0,0,0,0]
[3,87,40,67,148,57,399,0,0,0,0,19,9,22,27,1,78,19,9,22,27,1,78,0,0,0,0,0,0,0,0,0,0,0,0,0,0,0,0,0,0,0,0,0,0,0,0,0,0,0,0,0,0,0,0,0,0,0,0,0,0,1,1,0,0,0,0,0,2,0,0,0,0,0,0,0,0,0,0,0,0,0,0,0,0,0,0,0,0,0,0,0,0,0,0,0,0,0,0,0,0,0,0,0,0,0,0,0,0,0,0,0,0,0,0,0,0,0,0,0,0,0,0,0,0,0,0,0,0,0,0,0,0,0,0,0,0,0,0,0,0,0,0,0,0,0,0,0,0,0,0,0,0,0,0,0,0,0,0,0,0,0,0,0,0,0,0,0,0,0,0,0,0,0,0,0,0,0,0,0,0,0,0,0,0,0,0,0,0,0,0,0,0,0,0,0,0,0,0,0,0,0,0,0,0,0,0,0,0,0,0,0,0,0,0,0,0,0,0,0,0,0,0,0,0,0,0,0,0,0,0]
[4,321,159,60,195,64,799,0,0,0,0,14,9,26,35,4,88,14,9,26,35,4,88,0,0,0,0,0,0,0,0,0,0,0,0,0,0,0,0,0,0,0,0,0,0,0,0,0,0,0,0,0,0,0,0,0,0,0,0,0,0,1,0,0,0,0,0,0,1,0,0,0,0,0,0,0,0,0,0,0,0,0,0,0,0,0,0,0,0,0,0,0,0,0,0,0,0,0,0,0,0,0,0,0,0,0,0,0,0,0,0,0,0,0,0,0,0,0,0,0,0,0,0,0,0,0,0,0,0,0,0,0,0,0,0,0,0,0,0,0,0,0,0,0,0,0,0,0,0,0,0,0,0,0,0,0,0,0,0,0,0,0,0,0,0,0,0,0,0,0,0,0,0,0,0,0,0,0,0,0,0,0,0,0,0,0,0,0,0,0,0,0,0,0,0,0,0,0,0,0,0,0,0,0,0,0,0,0,0,0,0,0,0,0,0,0,0,0,0,0,0,0,0,0,0,0,0,0,0,0,0]
[5,28,45,46,92,61,272,0,0,0,0,21,8,19,30,4,82,18,7,19,29,4,77,0,0,0,0,0,0,0,0,0,0,0,0,0,0,0,0,0,0,0,0,0,0,0,0,0,0,0,0,0,0,0,0,0,0,0,0,0,0,0,0,0,0,0,0,0,0,0,0,0,0,0,0,0,0,0,0,0,0,0,0,0,0,0,0,0,0,0,0,0,0,0,0,0,0,0,0,0,0,0,0,0,0,0,0,0,0,0,0,0,0,0,0,0,0,0,0,0,0,0,0,0,0,0,0,0,0,0,0,0,0,0,0,0,0,0,0,0,0,0,0,0,0,0,0,0,0,0,0,0,0,0,0,0,0,0,0,0,0,0,0,0,0,0,0,0,0,0,0,0,0,0,0,0,0,0,0,0,0,0,0,0,0,0,0,0,0,0,0,0,0,0,0,0,0,0,0,0,0,0,0,0,0,0,0,0,0,0,0,0,0,0,0,0,0,0,0,0,0,0,0,0,0,0,0,0,0,0,0]
[6,29,11,29,87,34,190,0,0,0,0,13,9,14,27,4,67,13,9,13,27,4,66,0,0,0,0,0,0,0,0,0,0,0,0,0,0,0,0,0,0,0,0,0,0,0,0,0,0,0,0,0,0,0,0,0,0,0,0,0,0,0,0,0,0,0,0,0,0,0,0,0,0,0,0,0,0,0,0,0,0,0,0,0,0,0,0,0,0,0,0,0,0,0,0,0,0,0,0,0,0,0,0,0,0,0,0,0,0,0,0,0,0,0,0,0,0,0,0,0,0,0,0,0,0,0,0,0,0,0,0,0,0,0,0,0,0,0,0,0,0,0,0,0,0,0,0,0,0,0,0,0,0,0,0,0,0,0,0,0,0,0,0,0,0,0,0,0,0,0,0,0,0,0,0,0,0,0,0,0,0,0,0,0,0,0,0,0,0,0,0,0,0,0,0,0,0,0,0,0,0,0,0,0,0,0,0,0,0,0,0,0,0,0,0,0,0,0,0,0,0,0,0,0,0,0,0,0,0,0,0]
[7,6,6,28,53,13,106,0,0,0,0,48,7,20,32,1,108,48,7,20,32,1,108,0,0,0,0,0,0,0,0,0,0,0,0,0,0,0,0,0,0,0,0,0,0,0,0,0,0,0,0,0,0,0,0,0,0,0,0,0,0,0,0,0,0,0,0,0,0,0,0,0,0,0,0,0,0,0,0,0,0,0,0,0,0,0,0,0,0,0,0,0,0,0,0,0,0,0,0,0,0,0,0,0,0,0,0,0,0,0,0,0,0,0,0,0,0,0,0,0,0,0,0,0,0,0,0,0,0,0,0,0,0,0,0,0,0,0,0,0,0,0,0,0,0,0,0,0,0,0,0,0,0,0,0,0,0,0,0,0,0,0,0,0,0,0,0,0,0,0,0,0,0,0,0,0,0,0,0,0,0,0,0,0,0,0,0,0,0,0,0,0,0,0,0,0,0,0,0,0,0,0,0,0,0,0,0,0,0,0,0,0,0,0,0,0,0,0,0,0,0,0,0,0,0,0,0,0,0,0,0]
[8,8,3,21,25,10,67,0,0,0,0,11,14,24,31,12,92,9,13,24,31,12,89,0,0,0,0,0,0,0,0,0,0,0,0,0,0,0,0,0,0,0,0,0,0,0,0,0,0,0,0,0,0,0,0,0,0,0,0,0,0,0,0,1,0,0,0,0,0,0,0,0,0,0,0,0,0,0,0,0,0,0,0,0,0,0,0,0,0,0,0,0,0,0,0,0,0,0,0,0,0,0,0,0,0,0,0,0,0,0,0,0,0,0,0,0,0,0,0,0,0,0,0,0,0,0,0,0,0,0,0,0,0,0,0,0,0,0,0,0,0,0,0,0,0,0,0,0,0,0,0,0,0,0,0,0,0,0,0,0,0,0,0,0,0,0,0,0,0,0,0,0,0,0,0,0,0,0,0,0,0,0,0,0,0,0,0,0,0,0,0,0,0,0,0,0,0,0,0,0,0,0,0,0,0,0,0,0,0,0,0,0,0,0,0,0,0,0,0,0,0,0,0,0,0,0,0,0,0,0,0]
[10,5,6,9,42,10,72,0,0,0,0,29,6,17,30,7,89,27,6,17,30,7,87,0,0,0,0,0,0,0,0,0,0,0,0,0,0,0,0,0,0,0,0,0,0,0,0,0,0,0,0,0,0,0,0,0,0,0,0,0,0,0,1,0,0,0,0,0,1,0,0,0,0,0,0,0,0,0,0,0,0,0,0,0,0,0,0,0,0,0,0,0,0,0,0,0,0,0,0,0,0,0,0,0,0,0,0,0,0,0,0,0,0,0,0,0,0,0,0,0,0,0,0,0,0,0,0,0,0,0,0,0,0,0,0,0,0,0,0,0,0,0,0,0,0,0,0,0,0,0,0,0,0,0,0,0,0,0,0,0,0,0,0,0,0,0,0,0,0,0,0,0,0,0,0,0,0,0,0,0,0,0,0,0,0,0,0,0,0,0,0,0,0,0,0,0,0,0,0,0,0,0,0,0,0,0,0,0,0,0,0,0,0,0,0,0,0,0,0,0,0,0,0,0,0,0,0,0,0,0,0]
[11,4,4,15,21,11,55,0,0,0,0,13,6,11,40,11,81,11,5,11,40,11,78,0,0,0,0,0,0,0,0,0,0,0,0,0,0,0,0,0,0,0,0,0,0,0,0,0,0,0,0,0,0,0,0,0,0,0,0,2,0,0,0,0,0,2,0,0,0,0,0,0,0,0,0,0,0,0,0,0,0,0,0,0,0,0,0,0,0,0,0,0,0,0,0,0,0,0,0,0,0,0,0,0,0,0,0,0,0,0,0,0,0,0,0,0,0,0,0,0,0,0,0,0,0,0,0,0,0,0,0,0,0,0,0,0,0,0,0,0,0,0,0,0,0,0,0,0,0,0,0,0,0,0,0,0,0,0,0,0,0,0,0,0,0,0,0,0,0,0,0,0,0,0,0,0,0,0,0,0,0,0,0,0,0,0,0,0,0,0,0,0,0,0,0,0,0,0,0,0,0,0,0,0,0,0,0,0,0,0,0,0,0,0,0,0,0,0,0,0,0,0,0,0,0,0,0,0,0,0,0]
[9,5,8,12,31,10,66,0,0,0,0,12,7,21,43,5,88,7,7,21,40,5,80,0,0,0,0,0,0,0,0,0,0,0,0,0,0,0,0,0,0,0,0,0,0,0,0,0,0,0,0,0,0,0,0,0,0,0,0,0,0,0,0,0,0,0,0,0,0,0,0,0,0,0,0,0,0,0,0,0,0,0,0,0,0,0,0,0,0,0,0,0,0,0,0,0,0,0,0,0,0,0,0,0,0,0,0,0,0,0,0,0,0,0,0,0,0,0,0,0,0,0,0,0,0,0,0,0,0,0,0,0,0,0,0,0,0,0,0,0,0,0,0,0,0,0,0,0,0,0,0,0,0,0,0,0,0,0,0,0,0,0,0,0,0,0,0,0,0,0,0,0,0,0,0,0,0,0,0,0,0,0,0,0,0,0,0,0,0,0,0,0,0,0,0,0,0,0,0,0,0,0,0,0,0,0,0,0,0,0,0,0,0,0,0,0,0,0,0,0,0,0,0,0,0,0,0,0,0,0,0]
["Total general",924,361,520,1349,565,3719,0,0,0,0,210,101,241,383,63,998,196,98,240,379,63,976,0,0,0,0,0,0,0,0,0,0,0,0,0,0,0,0,0,0,0,0,0,0,0,0,0,0,0,0,0,0,0,0,0,0,0,0,2,0,2,2,1,0,2,0,0,4,0,0,0,0,0,0,0,0,0,0,0,0,0,0,0,0,0,0,0,0,0,0,0,0,0,0,0,0,0,0,0,0,0,0,0,0,0,0,0,0,0,0,0,0,0,0,0,0,0,0,0,0,0,0,0,0,0,0,0,0,0,0,0,0,0,0,0,0,0,0,0,0,0,0,0,0,0,0,0,0,0,0,0,0,0,0,0,0,0,0,0,0,0,0,0,0,0,0,0,0,0,0,0,0,0,0,0,0,0,0,0,0,0,0,0,0,0,0,0,0,0,0,0,0,0,0,0,0,0,0,0,0,0,0,0,0,0,0,0,0,0,0,0,0,0,0,0,0,0,0,0,0,0,0,0,0,0,0,0,0,0,0]
[]
[]
[]
[]
[]
[]
[]
[]
[]
[]
[]
[]
[]
[]
[]
[]
[]
[]
[]
[]
[]
[]
[]
[]
["Anio",2024]
["UE","(Todas)"]
["Red","LA CONVENCION"]
["MicroRed","(Todas)"]
["EESS","(Todas)"]
["Provincia","(Todas)"]
["Distrito","(Todas)"]
[]
["Etiquetas de fila"," BAS001"," BAS002"," BAS003"," BAS004"," BAS005"," BAS006"," BAS007"," BAS008"," BAS009"," BAS010"," BAS011"," BAS012"," BAS013"," BAS014"," BAS015"," BAS016"," BAS017"," BAS018"," BAS019"," BAS020"," BAS021"," BAS022"," BAS023"," BAS024"," BAS025"," BAS026"," BAS027"," BAS028"," BAS029"," BAS030"," BAS031"," BAS032"," BAS033"," BAS034"," BAS035"," BAS036"," BAS037"," BAS038"," BAS039"," BAS040"," BAS041"," BAS042"," BAS043"," BAS044"," BAS045"," BAS046"," BAS047"," BAS048"," BAS049"," BAS050"," BAS051"," BAS052"," BAS053"," BAS054"," BAS055"," BAS056"," BAS057"," BAS058"," BAS059"," BAS060"," BAS061"," BAS062"," BAS063"," BAS064"," BAS065"," BAS066"," BAS067"," BAS068"," BAS069"," BAS070"," BAS071"," BAS072"," BAS073"," BAS074"," BAS075"," BAS076"," BAS077"," BAS078"," BAS079"," BAS080"," BAS081"," BAS082"," BAS083"," BAS084"," BAS085"," BAS086"," BAS087"," BAS088"," BAS089"," BAS090"," BAS091"," BAS092"," BAS093"," BAS094"," BAS095"," BAS096"," BAS097"," BAS098"," BAS099"," BAS100"," BAS101"," BAS102"," BAS103"," BAS104"," BAS105"," BAS106"," BAS107"," BAS108"," BAS109"," BAS110"," BAS111"," BAS112"," BAS113"," BAS114"," BAS115"," BAS116"," BAS117"," BAS118"," BAS119"," BAS120"," BAS121"," BAS122"," BAS123"," BAS124"," BAS125"," BAS126"," BAS127"," BAS128"," BAS129"," BAS130"," BAS131"," BAS132"," BAS133"," BAS134"," BAS135"," BAS136"," BAS137"," BAS138"," BAS139"," BAS140"," BAS141"," BAS142"," BAS143"," BAS144"," BAS145"," BAS146"," BAS147"," BAS148"," BAS149"," BAS150"," BAS151"," BAS152"," BAS153"," BAS154"," BAS155"," BAS156"," BAS157"," BAS158"," BAS159"," BAS160"," BAS161"," BAS162"," BAS163"," BAS164"," BAS165"," BAS166"," BAS167"," BAS168"," BAS169"," BAS170"," BAS171"," BAS172"," BAS173"," BAS174"," BAS175"," BAS176"," BAS177"," BAS178"," BAS179"," BAS180"," BAS181"," BAS182"," BAS183"," BAS184"," BAS185"," BAS186"," BAS187"," BAS188"," BAS189"," BAS190"," BAS191"," BAS192"," BAS193"," BAS194"," BAS195"," BAS196"," BAS197"," BAS198"," BAS199"," BAS200"," BAS201"," BAS202"," BAS203"," BAS204"," BAS205"," BAS206"," BAS207"," BAS208"," BAS209"," BAS210"," BAS211"," BAS212"," BAS213"," BAS214"," BAS215"," BAS216"," BAS217"," BAS218"," BAS219"," BAS220"," BAS221"," BAS222"," BAS223"," BAS224"," BAS225"," BAS226"," BAS227"," BAS228"," BAS229"," BAS230"]
[1,5826,1299,3967,8847,3914,23853,0,0,0,0,0,0,0,0,0,0,0,0,0,0,0,0,0,0,0,0,0,0,0,0,0,0,0,0,0,0,0,0,0,0,0,0,0,0,0,0,0,0,0,0,0,0,0,0,0,0,0,0,0,0,0,0,0,0,0,0,0,0,0,0,0,0,0,0,0,0,0,0,0,0,0,0,0,0,0,0,0,0,0,0,0,0,0,0,0,0,0,0,0,0,45,41,90,249,67,2,26,33,43,321,5,12,35,110,30,0,2,6,13,139,0,0,0,1,0,0,0,0,0,1,0,0,0,0,0,0,0,0,0,0,0,0,0,0,0,0,0,0,0,0,24,8,40,123,28,2,8,2,12,159,1,0,0,2,0,0,0,0,0,2,0,0,0,0,0,0,0,0,0,0,0,0,1,0,0,0,0,0,0,1,0,0,0,0,0,0,0,0,0,0,0,0,0,0,0,0,0,0,0,0,0,0,0,0,0,0,0,0,0,0,0,0,0,0,0,0,0,0,0,0]
[2,2904,1000,2875,5677,2094,14550,0,0,0,0,0,0,0,0,0,0,0,0,0,0,0,0,0,0,0,0,0,0,0,0,0,0,0,0,0,0,0,0,0,0,0,0,0,0,0,0,0,0,0,0,0,0,0,0,0,0,0,0,0,0,0,0,0,0,0,0,0,0,0,0,0,0,0,0,0,0,0,0,0,0,0,0,0,0,0,0,0,0,0,0,0,0,0,0,0,0,0,0,0,0,122,113,321,444,152,5,82,82,134,697,32,44,120,190,41,0,22,27,42,292,0,0,0,0,0,0,0,0,0,0,0,0,0,0,0,0,0,0,0,0,0,0,0,0,0,0,0,0,0,0,51,18,83,141,29,0,21,5,32,210,0,1,0,1,0,0,0,0,1,1,0,0,0,0,0,0,0,0,0,0,1,0,16,17,1,0,0,0,0,33,0,0,0,0,0,0,0,0,0,0,0,0,0,0,0,0,0,0,0,0,0,0,0,0,0,0,0,0,0,0,0,0,0,0,0,0,0,0,0,0]
[3,2446,1020,2499,4877,1536,12378,0,0,0,0,0,0,0,0,0,0,0,0,0,0,0,0,0,0,0,0,0,0,0,0,0,0,0,0,0,0,0,0,0,0,0,0,0,0,0,0,0,0,0,0,0,0,0,0,0,0,0,0,0,0,0,0,0,0,0,0,0,0,0,0,0,0,0,0,0,0,0,0,0,0,0,0,0,0,0,0,0,0,0,0,0,0,0,0,0,0,0,0,0,0,95,103,238,370,120,3,63,89,81,570,13,13,58,85,15,0,7,11,12,137,0,0,0,0,0,0,0,0,0,0,0,0,0,0,0,0,0,0,0,0,0,0,0,0,0,0,0,0,0,0,17,4,50,60,15,0,4,2,13,101,0,0,0,0,0,0,0,0,0,0,0,0,0,0,0,0,0,0,0,0,1,0,9,8,0,0,0,0,0,17,0,0,0,0,0,0,0,0,0,0,0,0,0,0,0,0,0,0,0,0,0,0,0,0,0,0,0,0,0,0,0,0,0,0,0,0,0,0,0,0]
[4,4631,2692,2391,4765,2085,16564,0,0,0,0,0,0,0,0,0,0,0,0,0,0,0,0,0,0,0,0,0,0,0,0,0,0,0,0,0,0,0,0,0,0,0,0,0,0,0,0,0,0,0,0,0,0,0,0,0,0,0,0,0,0,0,0,0,0,0,0,0,0,0,0,0,0,0,0,0,0,0,0,0,0,0,0,0,0,0,0,0,0,0,0,0,0,0,0,0,0,0,0,0,0,155,119,208,393,91,7,109,96,110,553,21,9,40,69,14,0,13,7,11,104,0,0,0,0,0,0,0,0,0,0,0,0,0,0,0,0,0,0,0,0,0,0,0,0,0,0,0,0,0,0,28,7,37,37,4,0,9,1,9,72,0,0,0,0,0,0,0,0,0,0,0,0,0,0,0,0,0,0,0,0,1,0,4,4,0,0,0,0,0,8,0,0,0,0,0,0,0,0,0,0,0,0,0,0,0,0,0,0,0,0,0,0,0,0,0,0,0,0,0,0,0,0,0,0,0,0,0,0,0,0]
[5,3320,1888,2376,4354,1359,13297,0,0,0,0,0,0,0,0,0,0,0,0,0,0,0,0,0,0,0,0,0,0,0,0,0,0,0,0,0,0,0,0,0,0,0,0,0,0,0,0,0,0,0,0,0,0,0,0,0,0,0,0,0,0,0,0,0,0,0,0,0,0,0,0,0,0,0,0,0,0,0,0,0,0,0,0,0,0,0,0,0,0,0,0,0,0,0,0,0,0,0,0,0,0,170,159,292,346,84,1,103,157,126,580,34,25,62,82,13,1,24,16,24,134,0,0,0,0,0,0,0,0,0,0,0,0,0,0,0,0,0,0,0,0,0,0,0,0,0,0,0,0,0,0,51,13,58,64,6,0,21,8,23,112,0,0,0,0,0,0,0,0,0,0,0,0,0,0,0,0,0,0,0,0,3,0,2,10,1,0,0,0,0,12,0,0,0,0,0,0,0,0,0,0,0,0,0,0,0,0,0,0,0,0,0,0,0,0,0,0,0,0,0,0,0,0,0,0,0,0,0,0,0,0]
[6,2247,1558,1816,3996,1214,10831,0,0,0,0,0,0,0,0,0,0,0,0,0,0,0,0,0,0,0,0,0,0,0,0,0,0,0,0,0,0,0,0,0,0,0,0,0,0,0,0,0,0,0,0,0,0,0,0,0,0,0,0,0,0,0,0,0,0,0,0,0,0,0,0,0,0,0,0,0,0,0,0,0,0,0,0,0,0,0,0,0,0,0,0,0,0,0,0,0,0,0,0,0,0,67,57,112,154,56,3,50,38,61,238,10,7,16,46,7,1,6,5,5,60,0,0,0,0,0,0,0,0,0,0,0,0,0,0,0,0,0,0,0,0,0,0,0,0,0,0,0,0,0,0,21,3,15,20,4,0,8,3,3,35,0,0,0,0,0,0,0,0,0,0,0,0,0,0,0,0,0,0,0,0,0,0,0,0,0,0,0,0,0,0,0,0,0,0,0,0,0,0,0,0,0,0,0,0,0,0,0,0,0,0,0,0,0,0,0,0,0,0,0,0,0,0,0,0,0,0,0,0,0,0]
[7,1026,545,1503,2928,961,6963,0,0,0,0,0,0,0,0,0,0,0,0,0,0,0,0,0,0,0,0,0,0,0,0,0,0,0,0,0,0,0,0,0,0,0,0,0,0,0,0,0,0,0,0,0,0,0,0,0,0,0,0,0,0,0,0,0,0,0,0,0,0,0,0,0,0,0,0,0,0,0,0,0,0,0,0,0,0,0,0,0,0,0,0,0,0,0,0,0,0,0,0,0,0,43,25,67,122,47,2,32,22,19,182,4,0,7,8,4,0,4,0,0,15,0,0,0,0,0,0,0,0,0,0,0,0,0,0,0,0,0,0,0,0,0,0,0,0,0,0,0,0,0,0,11,5,3,10,2,0,4,2,6,12,0,0,0,0,0,0,0,0,0,0,0,0,0,0,0,0,0,0,0,0,0,0,0,0,0,0,0,0,0,0,0,0,0,0,0,0,0,0,0,0,0,0,0,0,0,0,0,0,0,0,0,0,0,0,0,0,0,0,0,0,0,0,0,0,0,0,0,0,0,0]
[8,845,456,1275,2188,805,5569,0,0,0,0,0,0,0,0,0,0,0,0,0,0,0,0,0,0,0,0,0,0,0,0,0,0,0,0,0,0,0,0,0,0,0,0,0,0,0,0,0,0,0,0,0,0,0,0,0,0,0,0,0,0,0,0,0,0,0,0,0,0,0,0,0,0,0,0,0,0,0,0,0,0,0,0,0,0,0,0,0,0,0,0,0,0,0,0,0,0,0,0,0,0,21,16,37,98,36,2,17,10,16,127,0,1,3,2,2,0,0,1,0,5,0,0,0,0,0,0,0,0,0,0,0,0,0,0,0,0,0,0,0,0,0,0,0,0,0,0,0,0,0,0,3,0,1,2,2,0,3,0,0,3,0,0,0,0,0,0,0,0,0,0,0,0,0,0,0,0,0,0,0,0,0,0,0,0,0,0,0,0,0,0,0,0,0,0,0,0,0,0,0,0,0,0,0,0,0,0,0,0,0,0,0,0,0,0,0,0,0,0,0,0,0,0,0,0,0,0,0,0,0,0]
[10,873,320,1146,2038,679,5056,0,0,0,0,0,0,0,0,0,0,0,0,0,0,0,0,0,0,0,0,0,0,0,0,0,0,0,0,0,0,0,0,0,0,0,0,0,0,0,0,0,0,0,0,0,0,0,0,0,0,0,0,0,0,0,0,0,0,0,0,0,0,0,0,0,0,0,0,0,0,0,0,0,0,0,0,0,0,0,0,0,0,0,0,0,0,0,0,0,0,0,0,0,0,8,6,38,62,17,0,6,4,14,90,0,0,0,1,0,0,0,0,0,1,0,0,1,0,0,0,0,0,0,1,0,0,0,0,0,0,0,0,0,0,0,0,0,0,0,0,0,0,0,0,1,0,3,4,0,0,1,0,1,6,0,1,0,0,0,0,0,0,1,0,0,0,0,0,0,0,0,0,0,0,0,0,0,0,0,0,0,0,0,0,0,0,0,0,0,0,0,0,0,0,0,0,0,0,0,0,0,0,0,0,0,0,0,0,0,0,0,0,0,0,0,0,0,0,0,0,0,0,0,0]
[11,729,417,1139,2278,626,5189,0,0,0,0,0,0,0,0,0,0,0,0,0,0,0,0,0,0,0,0,0,0,0,0,0,0,0,0,0,0,0,0,0,0,0,0,0,0,0,0,0,0,0,0,0,0,0,0,0,0,0,0,0,0,0,0,0,0,0,0,0,0,0,0,0,0,0,0,0,0,0,0,0,0,0,0,0,0,0,0,0,0,0,0,0,0,0,0,0,0,0,0,0,0,30,15,79,121,24,0,30,7,27,181,0,0,0,0,0,0,0,0,0,0,0,0,0,0,0,0,0,0,0,0,0,0,0,0,0,0,0,0,0,0,0,0,0,0,0,0,0,0,0,0,0,0,0,1,1,0,0,0,0,1,0,0,0,0,0,0,0,0,0,0,0,0,0,0,0,0,0,0,0,0,0,0,0,0,0,0,0,0,0,0,0,0,0,0,0,0,0,0,0,0,0,0,0,0,0,0,0,0,0,0,0,0,0,0,0,0,0,0,0,0,0,0,0,0,0,0,0,0,0,0]
[9,1150,353,1350,2089,646,5588,0,0,0,0,0,0,0,0,0,0,0,0,0,0,0,0,0,0,0,0,0,0,0,0,0,0,0,0,0,0,0,0,0,0,0,0,0,0,0,0,0,0,0,0,0,0,0,0,0,0,0,0,0,0,0,0,0,0,0,0,0,0,0,0,0,0,0,0,0,0,0,0,0,0,0,0,0,0,0,0,0,0,0,0,0,0,0,0,0,0,0,0,0,0,19,16,29,48,23,0,15,9,16,72,0,0,0,0,0,0,0,0,0,0,0,0,0,0,0,0,0,0,0,0,0,0,0,0,0,0,0,0,0,0,0,0,0,0,0,0,0,0,0,0,0,0,1,1,0,0,0,0,1,1,0,0,0,0,0,0,0,0,0,0,0,0,0,0,0,0,0,0,0,0,0,0,0,0,0,0,0,0,0,0,0,0,0,0,0,0,0,0,0,0,0,0,0,0,0,0,0,0,0,0,0,0,0,0,0,0,0,0,0,0,0,0,0,0,0,0,0,0,0,0]
["Total general",25997,11548,22337,44037,15919,119838,0,0,0,0,0,0,0,0,0,0,0,0,0,0,0,0,0,0,0,0,0,0,0,0,0,0,0,0,0,0,0,0,0,0,0,0,0,0,0,0,0,0,0,0,0,0,0,0,0,0,0,0,0,0,0,0,0,0,0,0,0,0,0,0,0,0,0,0,0,0,0,0,0,0,0,0,0,0,0,0,0,0,0,0,0,0,0,0,0,0,0,0,0,0,775,670,1511,2407,717,25,533,547,647,3611,119,111,341,593,126,2,78,73,107,887,0,0,1,1,0,0,0,0,0,2,0,0,0,0,0,0,0,0,0,0,0,0,0,0,0,0,0,0,0,0,207,58,291,463,91,2,79,23,100,712,1,2,0,3,0,0,0,0,2,3,0,0,0,0,0,0,0,0,0,0,6,0,32,39,2,0,0,0,0,71,0,0,0,0,0,0,0,0,0,0,0,0,0,0,0,0,0,0,0,0,0,0,0,0,0,0,0,0,0,0,0,0,0,0,0,0,0,0,0,0]

{"sheet":"Menu","index":2,"n_rows":31,"n_cols":9,"rows_kept":31,"cut":false,"hidden":false,"merged":[[1,4,1,16],[3,4,3,16],[2,4,2,16],[30,5,30,7]]}
[]
[null,null,null,null,"GERESA CUSCO"]
[null,null,null,null,"REPORTE HISMINSA 2024"]
[null,null,null,null,"METAXENICAS"]
[]
[]
[]
[]
[]
[]
[]
[]
[]
[]
[]
[]
[]
[]
[]
[]
[]
[]
[]
[]
[]
[]
[]
[]
[]
[]
[null,null,null,null,null,"Fecha Actulización DATA",null,null,"30/11/2024"]

{"sheet":"MALARIA","index":3,"n_rows":125,"n_cols":29,"rows_kept":125,"cut":false,"hidden":false,"merged":[[6,5,6,11],[6,15,6,20],[6,23,6,24],[6,25,6,27],[0,1,0,32],[1,1,1,32],[2,1,2,32],[3,1,3,32],[4,1,4,32],[93,7,93,9],[7,27,7,28],[8,5,8,11],[8,15,8,20],[8,23,8,24],[8,25,8,27],[10,5,10,11],[10,21,10,24],[10,25,10,27],[12,21,12,24],[12,25,12,27],[10,15,10,20]]}
[null,"DIRECCION REGIONAL DE SALUD CUSCO"]
[null,"DIRECCION EJECUTIVA DE INTELIGENCIA SANITARIA"]
[null,"DIRECCION DE ESTADISTICA Y TELECOMUNICACIONES"]
[null,"METAXENICAS MALARIA"]
[null,"INFORME OPERACIONAL MENSUAL"]
[]
[null,null,"RED DE SALUD",null,null,{"$f":"TD!F3","v":"LA CONVENCION"},null,null,null,null,null,null,null,"PROVINCIA",null,{"$f":"TD!F6","v":"(All)"},null,null,null,null,null,null,null,"AÑO :",null,{"$f":"TD!C10","v":"2024"}]
[]
[null,null,"MICRO RED",null,null,{"$f":"TD!F4","v":"(All)"},null,null,null,null,null,null,null,"DISTRITO",null,{"$f":"TD!F7","v":"(All)"},null,null,null,null,null,null,null,"MES :",null,{"$f":"TD!O17","v":"ENERO - NOVIEMBRE"}]
[]
[null,null,"ESTABLECIMIENTO",null,null,{"$f":"TD!F5","v":"(All)"},null,null,null,null,null,null,null,"U. E.",null,{"$f":"TD!F8","v":"(All)"},null,null,null,null,null,"POBLACION EN RIESGO",null,null,null,197907]
[]
[null,null,null,null,null,null,null,null,null,null,null,null,null,null,null,null,null,null,null,null,null,"POBLACION TOTAL",null,"POBLACION TOTAL",null,1342562]
[]
[null,"I.","LOCALIZACION DE CASOS",null,null,null,null,null,null,null,null,null,null,null,null,null,null,null,null,null,"LOCALIZACION DE CASOS",null,null,"00-11a","12-17a","18-29a","30-59a","60-99a","TOTAL"]
[]
[null,null,"1. Febriles Esperados (Ex30,25,15,10 ó 5)",null,null,null,null,0,null,null,null,null,null,null,null,null,null,null,null,null,"1. Febriles Esperados (Ex30,25,15,10 ó 5)",null,null,0,0,0,0,0,{"$f":"SUM(X17:AB17)","v":0}]
[]
[null,null,"2. Febriles Identificados",null,null,null,null,{"$f":"+GETPIVOTDATA(\" BAS016\",TD!$A$34)","v":13565},null,null,null,null,null,null,null,null,null,null,null,null,"2. Febriles Identificados",null,null,{"$f":"+GETPIVOTDATA(\" BAS011\",TD!$A$34)","v":2736},{"$f":"+GETPIVOTDATA(\" BAS012\",TD!$A$34)","v":1452},{"$f":"+GETPIVOTDATA(\" BAS013\",TD!$A$34)","v":2403},{"$f":"+GETPIVOTDATA(\" BAS014\",TD!$A$34)","v":5107},{"$f":"+GETPIVOTDATA(\" BAS015\",TD!$A$34)","v":1867},{"$f":"SUM(X19:AB19)","v":13565}]
[]
[null,null,"3. Febriles Examinados",null,null,null,null,{"$f":"H23+H25","v":13464},null,null,null,null,null,null,null,null,null,null,null,null,"3. Febriles Examinados",null,null,{"$f":"X23+X25","v":2718},{"$f":"Y23+Y25","v":1441},{"$f":"Z23+Z25","v":2384},{"$f":"AA23+AA25","v":5066},{"$f":"AB23+AB25","v":1855},{"$f":"SUM(X21:AB21)","v":13464}]
[]
[null,null,"    3.1 Febriles Examinados con Gota Gruesa",null,null,null,null,{"$f":"+GETPIVOTDATA(\" BAS022\",TD!$A$34)","v":13463},null,null,null,null,null,null,null,null,null,null,null,null,"    3.1 Febriles Examinados con Gota Gruesa",null,null,{"$f":"+GETPIVOTDATA(\" BAS017\",TD!$A$34)","v":2718},{"$f":"+GETPIVOTDATA(\" BAS018\",TD!$A$34)","v":1441},{"$f":"+GETPIVOTDATA(\" BAS019\",TD!$A$34)","v":2384},{"$f":"+GETPIVOTDATA(\" BAS020\",TD!$A$34)","v":5066},{"$f":"+GETPIVOTDATA(\" BAS021\",TD!$A$34)","v":1854},{"$f":"SUM(X23:AB23)","v":13463}]
[]
[null,null,"    3.2 Febriles Examinados con Tira Reactiva",null,null,null,null,{"$f":"+GETPIVOTDATA(\" BAS028\",TD!$A$34)","v":1},null,null,null,null,null,null,null,null,null,null,null,null,"    3.2 Febriles Examinados con Tira Reactiva",null,null,{"$f":"+GETPIVOTDATA(\" BAS023\",TD!$A$34)","v":0},{"$f":"+GETPIVOTDATA(\" BAS024\",TD!$A$34)","v":0},{"$f":"+GETPIVOTDATA(\" BAS025\",TD!$A$34)","v":0},{"$f":"+GETPIVOTDATA(\" BAS026\",TD!$A$34)","v":0},{"$f":"+GETPIVOTDATA(\" BAS027\",TD!$A$34)","v":1},{"$f":"SUM(X25:AB25)","v":1}]
[]
[null,null,"4. Febriles Examinados (+)",null,null,null,null,{"$f":"H29+H31","v":0},null,null,null,null,null,null,null,null,null,null,null,null,"4. Febriles Examinados (+)",null,null,{"$f":"X29+X31","v":0},{"$f":"Y29+Y31","v":0},{"$f":"Z29+Z31","v":0},{"$f":"AA29+AA31","v":0},{"$f":"AB29+AB31","v":0},{"$f":"SUM(X27:AB27)","v":0}]
[]
[null,null,"   4.1 Febriles Examinados con Gota Gruesa (+)",null,null,null,null,null,null,null,null,null,null,null,null,null,null,null,null,null,"   4.1 Febriles Examinados con Gota Gruesa (+)",null,null,null,null,null,null,null,{"$f":"SUM(X29:AB29)","v":0}]
[]
[null,null,"   4.2 Febriles Examinados con Tira Reactiva (+)",null,null,null,null,null,null,null,null,null,null,null,null,null,null,null,null,null,"   4.2 Febriles Examinados con Tira Reactiva (+)",null,null,null,null,null,null,null,{"$f":"SUM(X31:AB31)","v":0}]
[]
[]
[]
[null,"II.","CONTROL DE COLATERALES",null,null,null,null,null,null,null,null,null,null,null,null,null,null,null,null,null,"CONTROL DE COLATERALES",null,null,"00-11a","12-17a","18-29a","30-59a","60-99a","TOTAL"]
[]
[null,null,"1. Colaterales Esperados (Ex5)",null,null,null,null,"-",null,null,null,null,null,null,null,null,null,null,null,null,"1. Colaterales Esperados (Ex5)",null,null,{"$f":"+X60*5","v":5},{"$f":"+Y60*5","v":15},{"$f":"+Z60*5","v":40},{"$f":"+AA60*5","v":115},{"$f":"+AB60*5","v":10},{"$f":"SUM(X37:AB37)","v":185}]
[]
[null,null,"2. Colaterales Censados",null,null,null,null,{"$f":"+GETPIVOTDATA(\" BAS046\",TD!$A$34)","v":4},null,null,null,null,null,null,null,null,null,null,null,null,"2. Colaterales Censados",null,null,{"$f":"+GETPIVOTDATA(\" BAS041\",TD!$A$34)+(+GETPIVOTDATA(\" BAS047\",TD!$A$34))","v":0},{"$f":"+GETPIVOTDATA(\" BAS042\",TD!$A$34)+(+GETPIVOTDATA(\" BAS048\",TD!$A$34))","v":0},{"$f":"+GETPIVOTDATA(\" BAS043\",TD!$A$34)+(+GETPIVOTDATA(\" BAS049\",TD!$A$34))","v":0},{"$f":"+GETPIVOTDATA(\" BAS044\",TD!$A$34)+(+GETPIVOTDATA(\" BAS050\",TD!$A$34))","v":4},{"$f":"+GETPIVOTDATA(\" BAS045\",TD!$A$34)+(+GETPIVOTDATA(\" BAS051\",TD!$A$34))","v":0},{"$f":"SUM(X39:AB39)","v":4}]
[]
[null,null,"3. Colaterales Con Anamnesis y Ex. Fisico",null,null,null,null,{"$f":"+GETPIVOTDATA(\" BAS058\",TD!$A$34)","v":0},null,null,null,null,null,null,null,null,null,null,null,null,"3. Colaterales Con Anamnesis y Ex. Fisico",null,null,{"$f":"+GETPIVOTDATA(\" BAS053\",TD!$A$34)","v":0},{"$f":"+GETPIVOTDATA(\" BAS054\",TD!$A$34)","v":0},{"$f":"+GETPIVOTDATA(\" BAS055\",TD!$A$34)","v":0},{"$f":"+GETPIVOTDATA(\" BAS056\",TD!$A$34)","v":0},{"$f":"+GETPIVOTDATA(\" BAS057\",TD!$A$34)","v":0},{"$f":"SUM(X41:AB41)","v":0}]
[]
[null,null,"4. Colaterales Catalogados como Febriles",null,null,null,null,{"$f":"+GETPIVOTDATA(\" BAS064\",TD!$A$34)","v":0},null,null,null,null,null,null,null,null,null,null,null,null,"4. Colaterales Catalogados como Febriles",null,null,{"$f":"+GETPIVOTDATA(\" BAS059\",TD!$A$34)","v":0},{"$f":"+GETPIVOTDATA(\" BAS060\",TD!$A$34)","v":0},{"$f":"+GETPIVOTDATA(\" BAS061\",TD!$A$34)","v":0},{"$f":"+GETPIVOTDATA(\" BAS062\",TD!$A$34)","v":0},{"$f":"+GETPIVOTDATA(\" BAS063\",TD!$A$34)","v":0},{"$f":"SUM(X43:AB43)","v":0}]
[]
[null,null,"5. Colaterales Febriles Examinados",null,null,null,null,{"$f":"H47+H49","v":0},null,null,null,null,null,null,null,null,null,null,null,null,"5. Colaterales Febriles Examinados",null,null,{"$f":"X47+X49","v":0},{"$f":"Y47+Y49","v":0},{"$f":"Z47+Z49","v":0},{"$f":"AA47+AA49","v":0},{"$f":"AB47+AB49","v":0},{"$f":"SUM(X45:AB45)","v":0}]
[]
[null,null,"    5.1 Colateral Febril Examinado con GG",null,null,null,null,{"$f":"+GETPIVOTDATA(\" BAS070\",TD!$A$34)","v":0},null,null,null,null,null,null,null,null,null,null,null,null,"    5.1 Colateral Febril Examinado con GG",null,null,{"$f":"+GETPIVOTDATA(\" BAS065\",TD!$A$34)","v":0},{"$f":"+GETPIVOTDATA(\" BAS066\",TD!$A$34)","v":0},{"$f":"+GETPIVOTDATA(\" BAS067\",TD!$A$34)","v":0},{"$f":"+GETPIVOTDATA(\" BAS068\",TD!$A$34)","v":0},{"$f":"+GETPIVOTDATA(\" BAS069\",TD!$A$34)","v":0},{"$f":"SUM(X47:AB47)","v":0}]
[]
[null,null,"    5.2 Colateral Febril Examinados con TR",null,null,null,null,{"$f":"+GETPIVOTDATA(\" BAS076\",TD!$A$34)","v":0},null,null,null,null,null,null,null,null,null,null,null,null,"    5.2 Colateral Febril Examinados con TR",null,null,{"$f":"+GETPIVOTDATA(\" BAS071\",TD!$A$34)","v":0},{"$f":"+GETPIVOTDATA(\" BAS072\",TD!$A$34)","v":0},{"$f":"+GETPIVOTDATA(\" BAS073\",TD!$A$34)","v":0},{"$f":"+GETPIVOTDATA(\" BAS074\",TD!$A$34)","v":0},{"$f":"+GETPIVOTDATA(\" BAS075\",TD!$A$34)","v":0},{"$f":"SUM(X49:AB49)","v":0}]
[]
[null,null,"6. Colateral Febril Examinado (+)",null,null,null,null,{"$f":"H53+H55","v":0},null,null,null,null,null,null,null,null,null,null,null,null,"6. Colateral Febril Examinado (+)",null,null,{"$f":"X53+X55","v":0},{"$f":"Y53+Y55","v":0},{"$f":"Z53+Z55","v":0},{"$f":"AA53+AA55","v":0},{"$f":"AB53+AB55","v":0},{"$f":"SUM(X51:AB51)","v":0}]
[]
[null,null,"    6.1 Colateral Febril Examinado con GG (+)",null,null,null,null,{"$f":"+GETPIVOTDATA(\" BAS082\",TD!$A$34)","v":0},null,null,null,null,null,null,null,null,null,null,null,null,"    6.1 Colateral Febril Examinado con GG (+)",null,null,{"$f":"+GETPIVOTDATA(\" BAS077\",TD!$A$34)","v":0},{"$f":"+GETPIVOTDATA(\" BAS078\",TD!$A$34)","v":0},{"$f":"+GETPIVOTDATA(\" BAS079\",TD!$A$34)","v":0},{"$f":"+GETPIVOTDATA(\" BAS080\",TD!$A$34)","v":0},{"$f":"+GETPIVOTDATA(\" BAS081\",TD!$A$34)","v":0},{"$f":"SUM(X53:AB53)","v":0}]
[]
[null,null,"    6.2 Colateral Febril Examinado con TR (+)",null,null,null,null,{"$f":"+GETPIVOTDATA(\" BAS088\",TD!$A$34)","v":0},null,null,null,null,null,null,null,null,null,null,null,null,"    6.2 Colateral Febril Examinado con TR (+)",null,null,{"$f":"+GETPIVOTDATA(\" BAS083\",TD!$A$34)","v":0},{"$f":"+GETPIVOTDATA(\" BAS084\",TD!$A$34)","v":0},{"$f":"+GETPIVOTDATA(\" BAS085\",TD!$A$34)","v":0},{"$f":"+GETPIVOTDATA(\" BAS086\",TD!$A$34)","v":0},{"$f":"+GETPIVOTDATA(\" BAS087\",TD!$A$34)","v":0},{"$f":"SUM(X55:AB55)","v":0}]
[]
[]
[null,"IV","INFORME DE CASOS",null,null,null,null,null,null,null,null,null,null,null,null,null,null,null,null,null,"INFORME DE CASOS"]
[null,null,null,null,null,null,null,null,null,"< 1 a","1-9a","10-14a","15-19a","20-59a","60a Y +","TOTAL",null,"%",null,null,null,null,null,"00-11a","12-17a","18-29a","30-59a","60-99a","TOTAL"]
[null,null,"1. Total de Casos de Malaria",null,null,null,null,null,null,{"$f":"J62+J72","v":0},1,1,2,31,2,{"$f":"J60+K60+L60+M60+N60+O60","v":37},null,1,null,null,"1. Total de Casos de Malaria",null,null,{"$f":"X62+X72","v":1},{"$f":"Y62+Y72","v":3},{"$f":"Z62+Z72","v":8},{"$f":"AA62+AA72","v":23},{"$f":"AB62+AB72","v":2},{"$f":"SUM(X60:AB60)","v":37}]
[]
[null,null,"     1.1 Total de Casos Confirmados",null,null,null,null,null,null,{"$f":"J64+J66+J68+J70","v":0},0,0,0,1,0,{"$f":"J62+K62+L62+M62+N62+O62","v":1},null,{"$f":"P62/P60","v":2.7027027027027029E-2},null,null,"     1.1 Total de Casos Confirmados",null,null,{"$f":"X64+X66+X68+X70","v":0},{"$f":"Y64+Y66+Y68+Y70","v":0},{"$f":"Z64+Z66+Z68+Z70","v":0},{"$f":"AA64+AA66+AA68+AA70","v":1},{"$f":"AB64+AB66+AB68+AB70","v":0},{"$f":"SUM(X62:AB62)","v":1}]
[]
[null,null,"            a) Plasmodium Vivax",null,null,null,null,null,null,{"$f":"+GETPIVOTDATA(\" BAS094\",TD!$A$34)","v":0},{"$f":"+GETPIVOTDATA(\" BAS095\",TD!$A$34)","v":0},{"$f":"+GETPIVOTDATA(\" BAS096\",TD!$A$34)","v":0},{"$f":"+GETPIVOTDATA(\" BAS097\",TD!$A$34)","v":0},{"$f":"+GETPIVOTDATA(\" BAS098\",TD!$A$34)","v":1},{"$f":"+GETPIVOTDATA(\" BAS093\",TD!$A$34)","v":0},{"$f":"J64+K64+L64+M64+N64+O64","v":1},null,{"$f":"P64/P62","v":1},null,null,"            a) Plasmodium Vivax",null,null,{"$f":"+GETPIVOTDATA(\" BAS089\",TD!$A$34)","v":0},{"$f":"+GETPIVOTDATA(\" BAS090\",TD!$A$34)","v":0},{"$f":"+GETPIVOTDATA(\" BAS091\",TD!$A$34)","v":0},{"$f":"+GETPIVOTDATA(\" BAS092\",TD!$A$34)","v":1},{"$f":"+GETPIVOTDATA(\" BAS093\",TD!$A$34)","v":0},{"$f":"SUM(X64:AB64)","v":1}]
[]
[null,null,"            b) Plasmodium Falciparum",null,null,null,null,null,null,{"$f":"+GETPIVOTDATA(\" BAS104\",TD!$A$34)","v":0},{"$f":"+GETPIVOTDATA(\" BAS105\",TD!$A$34)","v":0},{"$f":"+GETPIVOTDATA(\" BAS106\",TD!$A$34)","v":0},{"$f":"+GETPIVOTDATA(\" BAS107\",TD!$A$34)","v":0},{"$f":"+GETPIVOTDATA(\" BAS108\",TD!$A$34)","v":0},{"$f":"+GETPIVOTDATA(\" BAS103\",TD!$A$34)","v":0},{"$f":"J66+K66+L66+M66+N66+O66","v":0},null,{"$f":"P66/P62","v":0},null,null,"            b) Plasmodium Falciparum",null,null,{"$f":"+GETPIVOTDATA(\" BAS099\",TD!$A$34)","v":0},{"$f":"+GETPIVOTDATA(\" BAS100\",TD!$A$34)","v":0},{"$f":"+GETPIVOTDATA(\" BAS101\",TD!$A$34)","v":0},{"$f":"+GETPIVOTDATA(\" BAS102\",TD!$A$34)","v":0},{"$f":"+GETPIVOTDATA(\" BAS103\",TD!$A$34)","v":0},{"$f":"SUM(X66:AB66)","v":0}]
[]
[null,null,"            c) Plasmodium Malariae",null,null,null,null,null,null,{"$f":"+GETPIVOTDATA(\" BAS114\",TD!$A$34)","v":0},{"$f":"+GETPIVOTDATA(\" BAS115\",TD!$A$34)","v":0},{"$f":"+GETPIVOTDATA(\" BAS116\",TD!$A$34)","v":0},{"$f":"+GETPIVOTDATA(\" BAS117\",TD!$A$34)","v":0},{"$f":"+GETPIVOTDATA(\" BAS118\",TD!$A$34)","v":0},{"$f":"+GETPIVOTDATA(\" BAS113\",TD!$A$34)","v":0},{"$f":"J68+K68+L68+M68+N68+O68","v":0},null,{"$f":"P68/P62","v":0},null,null,"            c) Plasmodium Malariae",null,null,{"$f":"+GETPIVOTDATA(\" BAS109\",TD!$A$34)","v":0},{"$f":"+GETPIVOTDATA(\" BAS110\",TD!$A$34)","v":0},{"$f":"+GETPIVOTDATA(\" BAS111\",TD!$A$34)","v":0},{"$f":"+GETPIVOTDATA(\" BAS112\",TD!$A$34)","v":0},{"$f":"+GETPIVOTDATA(\" BAS113\",TD!$A$34)","v":0},{"$f":"SUM(X68:AB68)","v":0}]
[]
[null,null,"            d) Mixto",null,null,null,null,null,null,{"$f":"+GETPIVOTDATA(\" BAS124\",TD!$A$34)","v":0},{"$f":"+GETPIVOTDATA(\" BAS125\",TD!$A$34)","v":0},{"$f":"+GETPIVOTDATA(\" BAS126\",TD!$A$34)","v":0},{"$f":"+GETPIVOTDATA(\" BAS127\",TD!$A$34)","v":0},{"$f":"+GETPIVOTDATA(\" BAS128\",TD!$A$34)","v":0},{"$f":"+GETPIVOTDATA(\" BAS123\",TD!$A$34)","v":0},{"$f":"J70+K70+L70+M70+N70+O70","v":0},null,{"$f":"P70/P62","v":0},null,null,"            d) Mixto",null,null,{"$f":"+GETPIVOTDATA(\" BAS119\",TD!$A$34)","v":0},{"$f":"+GETPIVOTDATA(\" BAS120\",TD!$A$34)","v":0},{"$f":"+GETPIVOTDATA(\" BAS121\",TD!$A$34)","v":0},{"$f":"+GETPIVOTDATA(\" BAS122\",TD!$A$34)","v":0},{"$f":"+GETPIVOTDATA(\" BAS123\",TD!$A$34)","v":0},{"$f":"SUM(X70:AB70)","v":0}]
[]
[null,null,"     1.2 Casos Probables",null,null,null,null,null,null,{"$f":"+GETPIVOTDATA(\" BAS134\",TD!$A$34)","v":0},{"$f":"+GETPIVOTDATA(\" BAS135\",TD!$A$34)","v":1},{"$f":"+GETPIVOTDATA(\" BAS136\",TD!$A$34)","v":1},{"$f":"+GETPIVOTDATA(\" BAS137\",TD!$A$34)","v":2},{"$f":"+GETPIVOTDATA(\" BAS138\",TD!$A$34)","v":30},{"$f":"+GETPIVOTDATA(\" BAS133\",TD!$A$34)","v":2},{"$f":"J72+K72+L72+M72+N72+O72","v":36},null,{"$f":"P72/P60","v":0.97297297297297303},null,null,"     1.2 Casos Probables",null,null,{"$f":"+GETPIVOTDATA(\" BAS129\",TD!$A$34)","v":1},{"$f":"+GETPIVOTDATA(\" BAS130\",TD!$A$34)","v":3},{"$f":"+GETPIVOTDATA(\" BAS131\",TD!$A$34)","v":8},{"$f":"+GETPIVOTDATA(\" BAS132\",TD!$A$34)","v":22},{"$f":"+GETPIVOTDATA(\" BAS133\",TD!$A$34)","v":2},{"$f":"SUM(X72:AB72)","v":36}]
[]
[null,null,"     1.3 Total de casos Conf. En Gestantes",null,null,null,null,null,null,null,null,{"$f":"L76+L78","v":0},{"$f":"M76+M78","v":0},{"$f":"N76+N78","v":0},{"$f":"O76+O78","v":0},{"$f":"O74+N74+M74+L74","v":0},null,{"$f":"P74/P60","v":0},null,null,"     1.3 Total de casos Conf. En Gestantes",null,null,{"$f":"X76+X78","v":0},{"$f":"Y76+Y78","v":0},{"$f":"Z76+Z78","v":0},{"$f":"AA76+AA78","v":0},{"$f":"AB76+AB78","v":0},{"$f":"SUM(X74:AB74)","v":0}]
[]
[null,null,"            a) Plasmodium Vivax",null,null,null,null,null,null,null,null,{"$f":"+GETPIVOTDATA(\" BAS144\",TD!$A$34)","v":0},{"$f":"+GETPIVOTDATA(\" BAS145\",TD!$A$34)","v":0},{"$f":"+GETPIVOTDATA(\" BAS146\",TD!$A$34)","v":0},{"$f":"+GETPIVOTDATA(\" BAS143\",TD!$A$34)","v":0},{"$f":"O76+N76+M76+L76","v":0},null,{"$f":"IFERROR(P76/P74,0)","v":0},null,null,"            a) Plasmodium Vivax",null,null,{"$f":"+GETPIVOTDATA(\" BAS139\",TD!$A$34)","v":0},{"$f":"+GETPIVOTDATA(\" BAS140\",TD!$A$34)","v":0},{"$f":"+GETPIVOTDATA(\" BAS141\",TD!$A$34)","v":0},{"$f":"+GETPIVOTDATA(\" BAS142\",TD!$A$34)","v":0},{"$f":"+GETPIVOTDATA(\" BAS143\",TD!$A$34)","v":0},{"$f":"SUM(X76:AB76)","v":0}]
[]
[null,null,"            b) Plasmodium Falciparum",null,null,null,null,null,null,null,null,{"$f":"+GETPIVOTDATA(\" BAS152\",TD!$A$34)","v":0},{"$f":"+GETPIVOTDATA(\" BAS153\",TD!$A$34)","v":0},{"$f":"+GETPIVOTDATA(\" BAS154\",TD!$A$34)","v":0},{"$f":"+GETPIVOTDATA(\" BAS151\",TD!$A$34)","v":0},{"$f":"O78+N78+M78+L78","v":0},null,{"$f":"IFERROR(P78/P74,0)","v":0},null,null,"            b) Plasmodium Falciparum",null,null,{"$f":"+GETPIVOTDATA(\" BAS147\",TD!$A$34)","v":0},{"$f":"+GETPIVOTDATA(\" BAS148\",TD!$A$34)","v":0},{"$f":"+GETPIVOTDATA(\" BAS149\",TD!$A$34)","v":0},{"$f":"+GETPIVOTDATA(\" BAS150\",TD!$A$34)","v":0},{"$f":"+GETPIVOTDATA(\" BAS151\",TD!$A$34)","v":0},{"$f":"SUM(X78:AB78)","v":0}]
[]
[null,null,"     1.4 Casos de Malaria Grave - Complicada",null,null,null,null,null,null,{"$f":"J82+J84","v":0},0,0,0,0,0,{"$f":"O80+N80+M80+L80+K80+J80","v":0},null,{"$f":"P80/P60","v":0},null,null,"     1.4 Casos de Malaria Grave - Complicada",null,null,{"$f":"X82+X84","v":0},{"$f":"Y82+Y84","v":0},{"$f":"Z82+Z84","v":0},{"$f":"AA82+AA84","v":0},{"$f":"AB82+AB84","v":0},{"$f":"SUM(X80:AB80)","v":0}]
[]
[null,null,"            a) Plasmodium Vivax",null,null,null,null,null,null,0,0,0,0,0,0,{"$f":"O82+N82+M82+L82+K82+J82","v":0},null,{"$f":"IFERROR(P82/$P$80,0)","v":0},null,null,"            a) Plasmodium Vivax",null,null,null,null,null,null,null,{"$f":"SUM(X82:AB82)","v":0}]
[]
[null,null,"            b) Plasmodium Falciparum",null,null,null,null,null,null,0,0,0,0,0,0,{"$f":"O84+N84+M84+L84+K84+J84","v":0},null,{"$f":"IFERROR(P84/$P$80,0)","v":0},null,null,"            b) Plasmodium Falciparum",null,null,null,null,null,null,null,{"$f":"SUM(X84:AB84)","v":0}]
[]
[null,"V.","TOTAL DE FALLECIDOS",null,null,null,null,null,null,{"$f":"J88+J90","v":0},0,0,0,0,0,{"$f":"O86+N86+M86+L86+K86+J86","v":0},null,1,null,null,"TOTAL DE FALLECIDOS",null,null,{"$f":"X88+X90","v":0},{"$f":"Y88+Y90","v":0},{"$f":"Z88+Z90","v":0},{"$f":"AA88+AA90","v":0},{"$f":"AB88+AB90","v":0},{"$f":"SUM(X86:AB86)","v":0}]
[]
[null,null,"1. Fallecidos por MGC a Plamodium Vivax",null,null,null,null,null,null,{"$f":"+GETPIVOTDATA(\" BAS160\",TD!$A$34)","v":0},{"$f":"+GETPIVOTDATA(\" BAS161\",TD!$A$34)","v":0},{"$f":"+GETPIVOTDATA(\" BAS162\",TD!$A$34)","v":0},{"$f":"+GETPIVOTDATA(\" BAS163\",TD!$A$34)","v":0},{"$f":"+GETPIVOTDATA(\" BAS164\",TD!$A$34)","v":0},{"$f":"+GETPIVOTDATA(\" BAS159\",TD!$A$34)","v":0},{"$f":"O88+N88+M88+L88+K88+J88","v":0},null,{"$f":"IFERROR(P88/$P$86,0)","v":0},null,null,"1. Fallecidos por MGC a Plamodium Vivax",null,null,{"$f":"+GETPIVOTDATA(\" BAS155\",TD!$A$34)","v":0},{"$f":"+GETPIVOTDATA(\" BAS156\",TD!$A$34)","v":0},{"$f":"+GETPIVOTDATA(\" BAS157\",TD!$A$34)","v":0},{"$f":"+GETPIVOTDATA(\" BAS158\",TD!$A$34)","v":0},{"$f":"+GETPIVOTDATA(\" BAS159\",TD!$A$34)","v":0},{"$f":"SUM(X88:AB88)","v":0}]
[]
[null,null,"2. Fallecidos por MGC a Plamodium Falciparum",null,null,null,null,null,null,null,null,null,null,null,null,{"$f":"O90+N90+M90+L90+K90+J90","v":0},null,{"$f":"IFERROR(P90/$P$86,0)","v":0},null,null,"2. Fallecidos por MGC a Plamodium Falciparum",null,null,null,null,null,null,null,{"$f":"SUM(X90:AB90)","v":0}]
[]
[null,"VI","RAM",null,null,null,null,null,null,{"$f":"+GETPIVOTDATA(\" BAS170\",TD!$A$34)","v":0},{"$f":"+GETPIVOTDATA(\" BAS171\",TD!$A$34)","v":0},{"$f":"+GETPIVOTDATA(\" BAS172\",TD!$A$34)","v":0},{"$f":"+GETPIVOTDATA(\" BAS173\",TD!$A$34)","v":0},{"$f":"+GETPIVOTDATA(\" BAS174\",TD!$A$34)","v":0},{"$f":"+GETPIVOTDATA(\" BAS169\",TD!$A$34)","v":0},{"$f":"O92+N92+M92+L92+K92+J92","v":0},null,{"$f":"P92/P60","v":0},null,null,"RAM",null,null,{"$f":"+GETPIVOTDATA(\" BAS165\",TD!$A$34)","v":0},{"$f":"+GETPIVOTDATA(\" BAS166\",TD!$A$34)","v":0},{"$f":"+GETPIVOTDATA(\" BAS167\",TD!$A$34)","v":0},{"$f":"+GETPIVOTDATA(\" BAS168\",TD!$A$34)","v":0},{"$f":"+GETPIVOTDATA(\" BAS169\",TD!$A$34)","v":0},{"$f":"SUM(X92:AB92)","v":0}]
[]
[null,"VII.","TRATAMIENTOS",null,null,null,null,"ADMINISTRADOS",null,null,"RECIBIDOS","         VIII. QUIMIOPROFILAXIS",null,null,null,null,null,null,null,null,"TRATAMIENTOS",null,null,"00-11a","12-17a","18-29a","30-59a","60-99a","TOTAL"]
[null,"   ","1. Total de Tratamientos",null,null,null,null,{"$f":"H97+H111","v":0},null,1,{"$f":"K97+K111","v":0},"             1. Total Quimioprofilaxis Iniciadas",null,null,null,{"$f":"P97+P99","v":0},null,1,null,null,"1. Total de Tratamientos",null,null,{"$f":"X97+X111","v":0},{"$f":"Y97+Y111","v":0},{"$f":"Z97+Z111","v":0},{"$f":"AA97+AA111","v":0},{"$f":"AB97+AB111","v":0},{"$f":"SUM(X95:AB95)","v":0}]
[]
[null,null,"2. Ttos. Para Casos Confirmados",null,null,null,null,{"$f":"H99+H101","v":0},null,{"$f":"H97/H95","v":{"$error":"#DIV/0!"}},{"$f":"K99+K101","v":0},"             2.  Quimioprofilaxis Malaria P. Vivax",null,null,null,0,null,{"$f":"IFERROR(P97/$P$95,0)","v":0},null,null,"2. Ttos. Para Casos Confirmados",null,null,{"$f":"X99+X101","v":0},{"$f":"Y99+Y101","v":0},{"$f":"Z99+Z101","v":0},{"$f":"AA99+AA101","v":0},{"$f":"AB99+AB101","v":0},{"$f":"SUM(X97:AB97)","v":0}]
[]
[null,null,"     2.1 Tratamiento Malaria P. Vivax",null,null,null,null,{"$f":"+GETPIVOTDATA(\" BAS180\",TD!$A$34)","v":0},null,{"$f":"H99/H97","v":{"$error":"#DIV/0!"}},0,"             3. Quimioprofilaxis Malaria P. Falciparum",null,null,null,{"$f":"P101+P103+P105","v":0},null,{"$f":"IFERROR(P99/$P$95,0)","v":0},null,null,"     2.1 Tratamiento Malaria P. Vivax",null,null,{"$f":"+GETPIVOTDATA(\" BAS175\",TD!$A$34)","v":0},{"$f":"+GETPIVOTDATA(\" BAS176\",TD!$A$34)","v":0},{"$f":"+GETPIVOTDATA(\" BAS177\",TD!$A$34)","v":0},{"$f":"+GETPIVOTDATA(\" BAS178\",TD!$A$34)","v":0},{"$f":"+GETPIVOTDATA(\" BAS179\",TD!$A$34)","v":0},{"$f":"SUM(X99:AB99)","v":0}]
[]
[null,null,"     2.2 Tratamiento Malaria P. Falciparum",null,null,null,null,{"$f":"H103+H105+H107+H109","v":0},null,{"$f":"H101/H97","v":{"$error":"#DIV/0!"}},{"$f":"K103+K105+K107+K109","v":0},"                   3.1 Cloroquina - Primaquina",null,null,null,0,null,{"$f":"IFERROR(P101/$P$99,0)","v":0},null,null,"     2.2 Tratamiento Malaria P. Falciparum",null,null,{"$f":"X103+X105+X107+X109","v":0},{"$f":"Y103+Y105+Y107+Y109","v":0},{"$f":"Z103+Z105+Z107+Z109","v":0},{"$f":"AA103+AA105+AA107+AA109","v":0},{"$f":"AB103+AB105+AB107+AB109","v":0},{"$f":"SUM(X101:AB101)","v":0}]
[]
[null,null,"            a. Cloroquina - Primaquina",null,null,null,null,{"$f":"+GETPIVOTDATA(\" BAS186\",TD!$A$34)","v":0},null,{"$f":"IFERROR(H103/H101,0)","v":0},0,"                   3.2 Mefloquina - Primaquina",null,null,null,0,null,{"$f":"IFERROR(P103/$P$99,0)","v":0},null,null,"            a. Cloroquina - Primaquina",null,null,{"$f":"+GETPIVOTDATA(\" BAS181\",TD!$A$34)","v":0},{"$f":"+GETPIVOTDATA(\" BAS182\",TD!$A$34)","v":0},{"$f":"+GETPIVOTDATA(\" BAS183\",TD!$A$34)","v":0},{"$f":"+GETPIVOTDATA(\" BAS184\",TD!$A$34)","v":0},{"$f":"+GETPIVOTDATA(\" BAS185\",TD!$A$34)","v":0},{"$f":"SUM(X103:AB103)","v":0}]
[]
[null,null,"            b. Sulfadoxina - Pirimetamina",null,null,null,null,0,null,{"$f":"IFERROR(H105/H101,0)","v":0},0,"                   3.3 Cloroquina- Progunanil/Primaqina",null,null,null,0,null,{"$f":"IFERROR(P105/$P$99,0)","v":0},null,null,"            b. Sulfadoxina - Pirimetamina",null,null,null,null,null,null,null,{"$f":"SUM(X105:AB105)","v":0}]
[]
[null,null,"            c. Mefloquina - Artemeter",null,null,null,null,0,null,{"$f":"IFERROR(H107/H101,0)","v":0},0,null,null,null,null,null,null,null,null,null,"            c. Mefloquina - Artemeter",null,null,null,null,null,null,null,{"$f":"SUM(X107:AB107)","v":0}]
[]
[null,null,"            d. Quinina - Clindamicina",null,null,null,null,0,null,{"$f":"IFERROR(H109/H101,0)","v":0},0,null,null,null,null,null,null,null,null,null,"            d. Quinina - Clindamicina",null,null,null,null,null,null,null,{"$f":"SUM(X109:AB109)","v":0}]
[]
[null,null,"3. Ttos. Para Casos Probables",null,null,null,null,{"$f":"+GETPIVOTDATA(\" BAS192\",TD!$A$34)","v":0},null,{"$f":"H111/H95","v":{"$error":"#DIV/0!"}},0,null,null,null,null,null,null,null,null,null,"3. Ttos. Para Casos Probables",null,null,{"$f":"+GETPIVOTDATA(\" BAS187\",TD!$A$34)","v":0},{"$f":"+GETPIVOTDATA(\" BAS188\",TD!$A$34)","v":0},{"$f":"+GETPIVOTDATA(\" BAS189\",TD!$A$34)","v":0},{"$f":"+GETPIVOTDATA(\" BAS190\",TD!$A$34)","v":0},{"$f":"+GETPIVOTDATA(\" BAS191\",TD!$A$34)","v":0},{"$f":"SUM(X111:AB111)","v":0}]
[]
[null,"IX.","SALDO MEDICAMENTOS"]
[null,null,"1. Cloroquina x 250 mg",null,null,null,null,null,null,0,null,null,null,null,0]
[]
[null,null,"2. Primaquina x 15 mg",null,null,null,null,null,null,0,null,null,null,null,0]
[]
[null,null,"3. Primaquina x 7.5 mg",null,null,null,null,null,null,0,null,null,null,null,0]
[]
[null,null,"4. Primaquina x 5 mg",null,null,null,null,null,null,0,null,null,null,null,0]
[]
[null,null,"5. Sulfadoxina/Primetamina x 5000/25 mg",null,null,null,null,null,null,0]
[]
[]
[null,null,"Lugar y Fecha",null,null,null,null,null,null,null,null,null,"Firma y Sello del Coordinador del PCMOEM"]

{"sheet":"BARTONELOSIS","index":4,"n_rows":61,"n_cols":26,"rows_kept":61,"cut":false,"hidden":false,"merged":[[0,1,0,31],[1,1,1,31],[2,1,2,31],[3,1,3,31],[4,1,4,31],[12,25,12,27],[10,15,10,20],[6,5,6,11],[6,15,6,20],[6,22,6,23],[6,25,6,27],[7,26,7,27],[8,22,8,23],[8,25,8,27],[10,5,10,11],[10,25,10,27],[8,5,8,11],[8,15,8,20]]}
[null,"DIRECCION REGIONAL DE SALUD CUSCO"]
[null,"DIRECCION EJECUTIVA DE INTELIGENCIA SANITARIA"]
[null,"DIRECCION DE ESTADISTICA Y TELECOMUNICACIONES"]
[null,"METAXENICAS BARTONELOSIS"]
[null,"INFORME OPERACIONAL MENSUAL"]
[]
[null,null,"RED DE SALUD",null,null,{"$f":"TD!F3","v":"LA CONVENCION"},null,null,null,null,null,null,null,"PROVINCIA",null,{"$f":"TD!F6","v":"(All)"},null,null,null,null,null,null,"AÑO :",null,null,{"$f":"TD!C10","v":"2024"}]
[]
[null,null,"MICRO RED",null,null,{"$f":"TD!F4","v":"(All)"},null,null,null,null,null,null,null,"DISTRITO",null,{"$f":"TD!F7","v":"(All)"},null,null,null,null,null,null,"MES :",null,null,{"$f":"TD!O17","v":"ENERO - NOVIEMBRE"}]
[]
[null,null,"ESTABLECIMIENTO",null,null,{"$f":"TD!F5","v":"(All)"},null,null,null,null,null,null,null,"U. E.",null,{"$f":"TD!F8","v":"(All)"},null,null,null,null,null,null,"POBLACION EN RIESGO",null,null,335132]
[]
[null,null,null,null,null,null,null,null,null,null,null,null,null,null,null,null,null,null,null,null,null,null,"POBLACION TOTAL",null,null,1342562]
[]
[]
[]
[null,"I. LOCALIZACION DE CASOS:",null,null,null,null,null,null,null,null,null,null,null,null,"I. LOCALIZACION DE CASOS:",null,null,null,null,"00-11a","12-17a","18-29a","30-59a","60-99a","TOTAL"]
[]
[null,"1. Nº Febriles Anémicos Agudos/Verrucosos esperados",null,null,null,0,null,"6. Nº Verrucosos Examinados",null,null,0,null,null,null,"1. Nº Febriles Anémicos Agudos/Verrucosos esperados",null,null,null,null,null,null,null,null,null,{"$f":"SUM(T19:X19)","v":0}]
[null,"2. Nº Febriles Anémicos Agudos Identificados",null,null,null,{"$f":"+GETPIVOTDATA(\" BAS016\",TD!$A$122)","v":998},null,"7. Nº Verrucosos Frotis (+)",null,null,0,null,null,null,"2. Nº Febriles Anémicos Agudos Identificados",null,null,null,null,{"$f":"+GETPIVOTDATA(\" BAS011\",TD!$A$122)","v":210},{"$f":"+GETPIVOTDATA(\" BAS012\",TD!$A$122)","v":101},{"$f":"+GETPIVOTDATA(\" BAS013\",TD!$A$122)","v":241},{"$f":"+GETPIVOTDATA(\" BAS014\",TD!$A$122)","v":383},{"$f":"+GETPIVOTDATA(\" BAS015\",TD!$A$122)","v":63},{"$f":"SUM(T20:X20)","v":998}]
[null,"3. Nº Febriles Anémicos Agudos Examinados",null,null,null,{"$f":"+GETPIVOTDATA(\" BAS022\",TD!$A$122)","v":976},null,"8. Nº Total Láminas de Diagnóstico",null,null,null,null,null,null,"3. Nº Febriles Anémicos Agudos Examinados",null,null,null,null,{"$f":"+GETPIVOTDATA(\" BAS017\",TD!$A$122)","v":196},{"$f":"+GETPIVOTDATA(\" BAS018\",TD!$A$122)","v":98},{"$f":"+GETPIVOTDATA(\" BAS019\",TD!$A$122)","v":240},{"$f":"+GETPIVOTDATA(\" BAS020\",TD!$A$122)","v":379},{"$f":"+GETPIVOTDATA(\" BAS021\",TD!$A$122)","v":63},{"$f":"SUM(T21:X21)","v":976}]
[null,"4. Nº Febriles Anémicos Agudos Frotis (+)",null,null,null,null,null,"9. Nº Láminas de Diagnóstico (+)",null,null,null,null,null,null,"4. Nº Febriles Anémicos Agudos Frotis (+)",null,null,null,null,null,null,null,null,null,{"$f":"SUM(T22:X22)","v":0}]
[null,"5. Nº Verrucosos Identificados",null,null,null,0,null,"10. Nº Láminas de Control",null,null,0,null,null,null,"5. Nº Verrucosos Identificados",null,null,null,null,null,null,null,null,null,{"$f":"SUM(T23:X23)","v":0}]
[]
[null,"II. INFORME DE CASOS:",null,null,"<1a","1-9a","10-14a","15-19a","20-59a","60a y +","TOTAL",null,null,null,"II. INFORME DE CASOS:",null,null,null,null,"00-11a","12-17a","18-29a","30-59a","60-99a","TOTAL"]
[null,"    1. Total de Casos",null,null,{"$f":"E28+E32","v":0},2,0,0,4,1,{"$f":"SUM(E26:J26)","v":7},null,null,null,"    1. Total de Casos",null,null,null,null,{"$f":"T28+T32","v":2},{"$f":"U28+U32","v":0},{"$f":"V28+V32","v":2},{"$f":"W28+W32","v":2},{"$f":"X28+X32","v":1},{"$f":"SUM(T26:X26)","v":7}]
[]
[null,"    2. Casos Confirmados:",null,null,{"$f":"SUM(E29:E31)","v":0},0,0,0,0,0,0,null,null,null,"    2. Casos Confirmados:",null,null,null,null,{"$f":"SUM(T29:T31)","v":0},{"$f":"SUM(U29:U31)","v":0},{"$f":"SUM(V29:V31)","v":0},{"$f":"SUM(W29:W31)","v":0},{"$f":"SUM(X29:X31)","v":0},{"$f":"SUM(T28:X28)","v":0}]
[null,"       2.1. B. Aguda",null,null,{"$f":"+GETPIVOTDATA(\" BAS034\",TD!$A$122)","v":0},{"$f":"+GETPIVOTDATA(\" BAS035\",TD!$A$122)","v":0},{"$f":"+GETPIVOTDATA(\" BAS036\",TD!$A$122)","v":0},{"$f":"+GETPIVOTDATA(\" BAS037\",TD!$A$122)","v":0},{"$f":"+GETPIVOTDATA(\" BAS038\",TD!$A$122)","v":0},{"$f":"+GETPIVOTDATA(\" BAS033\",TD!$A$122)","v":0},0,null,null,null,"       2.1. B. Aguda",null,null,null,null,{"$f":"+GETPIVOTDATA(\" BAS029\",TD!$A$122)","v":0},{"$f":"+GETPIVOTDATA(\" BAS030\",TD!$A$122)","v":0},{"$f":"+GETPIVOTDATA(\" BAS031\",TD!$A$122)","v":0},{"$f":"+GETPIVOTDATA(\" BAS032\",TD!$A$122)","v":0},{"$f":"+GETPIVOTDATA(\" BAS033\",TD!$A$122)","v":0},{"$f":"SUM(T29:X29)","v":0}]
[null,"       2.2. B. Verrucosa o Crónica",null,null,{"$f":"+GETPIVOTDATA(\" BAS044\",TD!$A$122)","v":0},{"$f":"+GETPIVOTDATA(\" BAS045\",TD!$A$122)","v":0},{"$f":"+GETPIVOTDATA(\" BAS046\",TD!$A$122)","v":0},{"$f":"+GETPIVOTDATA(\" BAS047\",TD!$A$122)","v":0},{"$f":"+GETPIVOTDATA(\" BAS048\",TD!$A$122)","v":0},{"$f":"+GETPIVOTDATA(\" BAS043\",TD!$A$122)","v":0},0,null,null,null,"       2.2. B. Verrucosa o Crónica",null,null,null,null,{"$f":"+GETPIVOTDATA(\" BAS039\",TD!$A$122)","v":0},{"$f":"+GETPIVOTDATA(\" BAS040\",TD!$A$122)","v":0},{"$f":"+GETPIVOTDATA(\" BAS041\",TD!$A$122)","v":0},{"$f":"+GETPIVOTDATA(\" BAS042\",TD!$A$122)","v":0},{"$f":"+GETPIVOTDATA(\" BAS043\",TD!$A$122)","v":0},{"$f":"SUM(T30:X30)","v":0}]
[null,"       2.3. B. Grave Complicada",null,null,{"$f":"+GETPIVOTDATA(\" BAS054\",TD!$A$122)","v":0},{"$f":"+GETPIVOTDATA(\" BAS055\",TD!$A$122)","v":0},{"$f":"+GETPIVOTDATA(\" BAS056\",TD!$A$122)","v":0},{"$f":"+GETPIVOTDATA(\" BAS057\",TD!$A$122)","v":0},{"$f":"+GETPIVOTDATA(\" BAS058\",TD!$A$122)","v":0},{"$f":"+GETPIVOTDATA(\" BAS053\",TD!$A$122)","v":0},0,null,null,null,"       2.3. B. Grave Complicada",null,null,null,null,{"$f":"+GETPIVOTDATA(\" BAS049\",TD!$A$122)","v":0},{"$f":"+GETPIVOTDATA(\" BAS050\",TD!$A$122)","v":0},{"$f":"+GETPIVOTDATA(\" BAS051\",TD!$A$122)","v":0},{"$f":"+GETPIVOTDATA(\" BAS052\",TD!$A$122)","v":0},{"$f":"+GETPIVOTDATA(\" BAS053\",TD!$A$122)","v":0},{"$f":"SUM(T31:X31)","v":0}]
[null,"    3. Casos Probables",null,null,{"$f":"+GETPIVOTDATA(\" BAS064\",TD!$A$122)","v":0},{"$f":"+GETPIVOTDATA(\" BAS065\",TD!$A$122)","v":2},{"$f":"+GETPIVOTDATA(\" BAS066\",TD!$A$122)","v":0},{"$f":"+GETPIVOTDATA(\" BAS067\",TD!$A$122)","v":0},{"$f":"+GETPIVOTDATA(\" BAS068\",TD!$A$122)","v":4},{"$f":"+GETPIVOTDATA(\" BAS063\",TD!$A$122)","v":1},7,null,null,null,"    3. Casos Probables",null,null,null,null,{"$f":"+GETPIVOTDATA(\" BAS059\",TD!$A$122)","v":2},{"$f":"+GETPIVOTDATA(\" BAS060\",TD!$A$122)","v":0},{"$f":"+GETPIVOTDATA(\" BAS061\",TD!$A$122)","v":2},{"$f":"+GETPIVOTDATA(\" BAS062\",TD!$A$122)","v":2},{"$f":"+GETPIVOTDATA(\" BAS063\",TD!$A$122)","v":1},{"$f":"SUM(T32:X32)","v":7}]
[]
[null,"III. FALLECIDOS",null,null,{"$f":"+GETPIVOTDATA(\" BAS074\",TD!$A$122)","v":0},{"$f":"+GETPIVOTDATA(\" BAS075\",TD!$A$122)","v":0},{"$f":"+GETPIVOTDATA(\" BAS076\",TD!$A$122)","v":0},{"$f":"+GETPIVOTDATA(\" BAS077\",TD!$A$122)","v":0},{"$f":"+GETPIVOTDATA(\" BAS078\",TD!$A$122)","v":0},{"$f":"+GETPIVOTDATA(\" BAS073\",TD!$A$122)","v":0},0,null,null,null,"III. FALLECIDOS",null,null,null,null,{"$f":"+GETPIVOTDATA(\" BAS069\",TD!$A$122)","v":0},{"$f":"+GETPIVOTDATA(\" BAS070\",TD!$A$122)","v":0},{"$f":"+GETPIVOTDATA(\" BAS071\",TD!$A$122)","v":0},{"$f":"+GETPIVOTDATA(\" BAS072\",TD!$A$122)","v":0},{"$f":"+GETPIVOTDATA(\" BAS073\",TD!$A$122)","v":0},{"$f":"SUM(T34:X34)","v":0}]
[]
[null,"IV. RAM",null,null,{"$f":"+GETPIVOTDATA(\" BAS083\",TD!$A$122)","v":0},null,null,null,null,null,null,null,null,null,"IV. RAM",null,null,null,null,{"$f":"+GETPIVOTDATA(\" BAS079\",TD!$A$122)","v":0},{"$f":"+GETPIVOTDATA(\" BAS080\",TD!$A$122)","v":0},{"$f":"+GETPIVOTDATA(\" BAS081\",TD!$A$122)","v":0},{"$f":"+GETPIVOTDATA(\" BAS082\",TD!$A$122)","v":0},{"$f":"+GETPIVOTDATA(\" BAS083\",TD!$A$122)","v":0},{"$f":"SUM(T36:X36)","v":0}]
[]
[null,"V. CONTROL DE COLATERALES",null,null,null,null,null,null,null,null,null,null,null,null,"V. CONTROL DE COLATERALES",null,null,null,null,"00-11a","12-17a","18-29a","30-59a","60-99a","TOTAL"]
[]
[null,"1. Colaterales Censados",null,null,{"$f":"+GETPIVOTDATA(\" BAS094\",TD!$A$122)+(+GETPIVOTDATA(\" BAS054\",TD!$A$122))","v":0},null,null,null,null,null,null,null,null,null,"1. Colaterales Censados",null,null,null,null,{"$f":"+GETPIVOTDATA(\" BAS089\",TD!$A$122)+(+GETPIVOTDATA(\" BAS095\",TD!$A$122))","v":0},{"$f":"+GETPIVOTDATA(\" BAS090\",TD!$A$122)+(+GETPIVOTDATA(\" BAS096\",TD!$A$122))","v":0},{"$f":"+GETPIVOTDATA(\" BAS091\",TD!$A$122)+(+GETPIVOTDATA(\" BAS097\",TD!$A$122))","v":0},{"$f":"+GETPIVOTDATA(\" BAS092\",TD!$A$122)+(+GETPIVOTDATA(\" BAS098\",TD!$A$122))","v":0},{"$f":"+GETPIVOTDATA(\" BAS093\",TD!$A$122)+(+GETPIVOTDATA(\" BAS099\",TD!$A$122))","v":0},{"$f":"SUM(T40:X40)","v":0}]
[null,"2. Colaterales Examinados",null,null,{"$f":"+GETPIVOTDATA(\" BAS106\",TD!$A$122)","v":0},null,null,null,null,null,null,null,null,null,"2. Colaterales Examinados",null,null,null,null,{"$f":"+GETPIVOTDATA(\" BAS101\",TD!$A$122)","v":0},{"$f":"+GETPIVOTDATA(\" BAS102\",TD!$A$122)","v":0},{"$f":"+GETPIVOTDATA(\" BAS103\",TD!$A$122)","v":0},{"$f":"+GETPIVOTDATA(\" BAS104\",TD!$A$122)","v":0},{"$f":"+GETPIVOTDATA(\" BAS105\",TD!$A$122)","v":0},{"$f":"SUM(T41:X41)","v":0}]
[null,"3. Colaterales Examinados Frotis +",null,null,{"$f":"+GETPIVOTDATA(\" BAS112\",TD!$A$122)","v":0},null,null,null,null,null,null,null,null,null,"3. Colaterales Examinados Frotis +",null,null,null,null,{"$f":"+GETPIVOTDATA(\" BAS107\",TD!$A$122)","v":0},{"$f":"+GETPIVOTDATA(\" BAS108\",TD!$A$122)","v":0},{"$f":"+GETPIVOTDATA(\" BAS109\",TD!$A$122)","v":0},{"$f":"+GETPIVOTDATA(\" BAS110\",TD!$A$122)","v":0},{"$f":"+GETPIVOTDATA(\" BAS111\",TD!$A$122)","v":0},{"$f":"SUM(T42:X42)","v":0}]
[]
[null,"VI. TRATAMIENTO UTILIZADOS",null,null,null,null,null,null,null,null,null,null,null,null,"VI. TRATAMIENTO UTILIZADOS",null,null,null,null,"00-11a","12-17a","18-29a","30-59a","60-99a","TOTAL"]
[]
[null,"1. Bartonellosis Aguda",null,null,{"$f":"+GETPIVOTDATA(\" BAS118\",TD!$A$122)","v":0},null,null,null,null,null,null,null,null,null,"1. Bartonellosis Aguda",null,null,null,null,{"$f":"+GETPIVOTDATA(\" BAS113\",TD!$A$122)","v":0},{"$f":"+GETPIVOTDATA(\" BAS114\",TD!$A$122)","v":0},{"$f":"+GETPIVOTDATA(\" BAS115\",TD!$A$122)","v":0},{"$f":"+GETPIVOTDATA(\" BAS116\",TD!$A$122)","v":0},{"$f":"+GETPIVOTDATA(\" BAS117\",TD!$A$122)","v":0},{"$f":"SUM(T46:X46)","v":0}]
[null,"2. Bartonellosis Grave-Complicada",null,null,{"$f":"+GETPIVOTDATA(\" BAS124\",TD!$A$122)","v":0},null,null,null,null,null,null,null,null,null,"2. Bartonellosis Grave-Complicada",null,null,null,null,{"$f":"+GETPIVOTDATA(\" BAS119\",TD!$A$122)","v":0},{"$f":"+GETPIVOTDATA(\" BAS120\",TD!$A$122)","v":0},{"$f":"+GETPIVOTDATA(\" BAS121\",TD!$A$122)","v":0},{"$f":"+GETPIVOTDATA(\" BAS122\",TD!$A$122)","v":0},{"$f":"+GETPIVOTDATA(\" BAS123\",TD!$A$122)","v":0},{"$f":"SUM(T47:X47)","v":0}]
[null,"3. Bartonellosis Verrucosa-Crónica",null,null,{"$f":"+GETPIVOTDATA(\" BAS130\",TD!$A$122)","v":0},null,null,null,null,null,null,null,null,null,"3. Bartonellosis Verrucosa-Crónica",null,null,null,null,{"$f":"+GETPIVOTDATA(\" BAS125\",TD!$A$122)","v":0},{"$f":"+GETPIVOTDATA(\" BAS126\",TD!$A$122)","v":0},{"$f":"+GETPIVOTDATA(\" BAS127\",TD!$A$122)","v":0},{"$f":"+GETPIVOTDATA(\" BAS128\",TD!$A$122)","v":0},{"$f":"+GETPIVOTDATA(\" BAS129\",TD!$A$122)","v":0},{"$f":"SUM(T48:X48)","v":0}]
[]
[null,"VII. SALDO DE MEDICAMENTOS"]
[]
[null,"CAF Cap. X 500 mg.",null,null,0,null,null,"REP. Cap. X 300 mgs.",null,null,0]
[null,"CAF Cap. X 250 mg.",null,null,0,null,null,"Norfloxacina x 400 mgs",null,null,0]
[null,"CAF Fco. X 1 gr.",null,null,0,null,null,"Ciproxina x 500 mgs.",null,null,0]
[null,"PGNa x 1000,000",null,null,0,null,null,"Ciproxina x 250 mgs.",null,null,0]
[null,"CAF. Fco. X125 mg.",null,null,0]
[null,"STM Fco. X 1 gr.",null,null,0]
[]
[]
[]
[null,"FECHA:",null,null,null,null,null,"Coordinador del Prog. Control Malaria y OEM"]

{"sheet":"LEISHMANIA","index":5,"n_rows":73,"n_cols":25,"rows_kept":73,"cut":false,"hidden":false,"merged":[[6,5,6,9],[6,15,6,19],[6,22,6,23],[6,24,6,26],[0,1,0,31],[1,1,1,31],[2,1,2,31],[3,1,3,31],[4,1,4,31],[33,1,33,3],[33,13,33,18],[7,26,7,27],[8,5,8,9],[8,15,8,19],[8,22,8,23],[8,24,8,26],[10,5,10,9],[10,24,10,26],[30,1,30,3],[31,1,31,3],[31,13,31,18],[32,1,32,3],[32,13,32,18],[12,24,12,26],[10,15,10,19],[34,1,34,3],[34,13,34,18],[35,1,35,3],[35,13,35,18],[36,1,36,3],[36,13,36,18],[37,1,37,3],[37,13,37,18],[38,1,38,3],[38,13,38,18],[39,1,39,3],[39,13,39,18],[40,1,40,3],[40,13,40,18],[41,1,41,3],[41,13,41,18],[42,1,42,3],[42,13,42,18],[47,13,47,18],[48,1,48,3],[48,13,48,18],[43,1,43,3],[43,13,43,18],[44,1,44,3],[44,13,44,18],[45,1,45,3],[45,13,45,18],[46,1,46,3],[46,13,46,18],[47,1,47,3],[58,13,58,18],[49,1,49,3],[49,13,49,18],[50,1,50,3],[50,13,50,18],[51,13,51,18],[52,13,52,18],[53,13,53,18],[54,13,54,18],[55,13,55,18],[56,13,56,18],[57,13,57,18]]}
[null,"DIRECCION REGIONAL DE SALUD CUSCO"]
[null,"DIRECCION EJECUTIVA DE INTELIGENCIA SANITARIA"]
[null,"DIRECCION DE ESTADISTICA Y TELECOMUNICACIONES"]
[null,"METAXENICAS LEISHMANIASIS"]
[null,"INFORME OPERACIONAL MENSUAL"]
[]
[null,null,"RED DE SALUD",null,null,{"$f":"TD!F3","v":"LA CONVENCION"},null,null,null,null,null,"PROVINCIA",null,null,null,{"$f":"TD!F6","v":"(All)"},null,null,null,null,null,"AÑO :",null,null,{"$f":"TD!C10","v":"2024"}]
[]
[null,null,"MICRO RED",null,null,{"$f":"TD!F4","v":"(All)"},null,null,null,null,null,"DISTRITO",null,null,null,{"$f":"TD!F7","v":"(All)"},null,null,null,null,null,"MES :",null,null,{"$f":"TD!O17","v":"ENERO - NOVIEMBRE"}]
[]
[null,null,"ESTABLECIMIENTO",null,null,{"$f":"TD!F5","v":"(All)"},null,null,null,null,null,"U. E.",null,null,null,{"$f":"TD!F8","v":"(All)"},null,null,null,null,null,"POBLACION EN RIESGO",null,null,342825]
[]
[null,null,null,null,null,null,null,null,null,null,null,null,null,null,null,null,null,null,null,null,null,"POBLACION TOTAL",null,null,1342562]
[]
[]
[null,"I. LOCALIZACION DE CASOS .",null,"NRO","%",null,null,null,null,"NRO","%",null,null,"I. LOCALIZACION DE CASOS .",null,null,null,null,null,"00-11a","12-17a","18-29a","30-59a","60-99a","TOTAL"]
[]
[null,"    1. NRO. DE PERSONAS CON LESIONES",null,null,null,null,null,null,null,null,null,null,null,"    1. NRO. DE PERSONAS CON LESIONES"]
[null,"        SOSPECHOSAS DE LESHMANIASIS",null,{"$f":"+GETPIVOTDATA(\" BAS015\",TD!$A$58)","v":180},1,"4. NRO. DE MUESTRA P/ DIAGNOSTICO",null,null,null,0,null,null,null,"        SOSPECHOSAS DE LESHMANIASIS",null,null,null,null,null,{"$f":"GETPIVOTDATA(\" BAS011\",TD!$A$58)","v":111},{"$f":"+GETPIVOTDATA(\" BAS012\",TD!$A$58)","v":57},{"$f":"+GETPIVOTDATA(\" BAS013\",TD!$A$58)","v":144},{"$f":"+GETPIVOTDATA(\" BAS014\",TD!$A$58)","v":426},{"$f":"+GETPIVOTDATA(\" BAS015\",TD!$A$58)","v":180},{"$f":"SUM(T19:X19)","v":918}]
[null,"    2. NRO. DE PERSONAS EXAMINADAS",null,{"$f":"SUM(D21:D24)","v":596},{"$f":"IFERROR(D19/D20,0)","v":0.30201342281879195},"   4.1.          FROTIS            +",null,null,null,0,null,null,null,"    2. NRO. DE PERSONAS EXAMINADAS",null,null,null,null,null,{"$f":"SUM(T21:T24)","v":84},{"$f":"SUM(U21:U24)","v":44},{"$f":"SUM(V21:V24)","v":97},{"$f":"SUM(W21:W24)","v":270},{"$f":"SUM(X21:X24)","v":101},596]
[null,"       2.1. NRO. EX/FROTIS",null,{"$f":"+GETPIVOTDATA(\" BAS022\",TD!$A$58)","v":420},{"$f":"IFERROR(D21/D20,0)","v":0.70469798657718119},"                   CULTIVO          +",null,null,null,0,null,null,null,"       2.1. NRO. EX/FROTIS",null,null,null,null,null,{"$f":"+GETPIVOTDATA(\" BAS017\",TD!$A$58)","v":69},{"$f":"+GETPIVOTDATA(\" BAS018\",TD!$A$58)","v":38},{"$f":"+GETPIVOTDATA(\" BAS019\",TD!$A$58)","v":72},{"$f":"+GETPIVOTDATA(\" BAS020\",TD!$A$58)","v":181},{"$f":"+GETPIVOTDATA(\" BAS021\",TD!$A$58)","v":60},420]
[null,"       2.2. NRO. EX/LEISHMANIA",null,{"$f":"+GETPIVOTDATA(\" BAS028\",TD!$A$58)","v":0},{"$f":"IFERROR(D22/D20,0)","v":0},"                    SEROLOGIA    +",null,null,null,0,null,null,null,"       2.2. NRO. EX/LEISHMANIA",null,null,null,null,null,{"$f":"+GETPIVOTDATA(\" BAS023\",TD!$A$58)","v":0},{"$f":"+GETPIVOTDATA(\" BAS024\",TD!$A$58)","v":0},{"$f":"+GETPIVOTDATA(\" BAS025\",TD!$A$58)","v":0},{"$f":"+GETPIVOTDATA(\" BAS026\",TD!$A$58)","v":0},{"$f":"+GETPIVOTDATA(\" BAS027\",TD!$A$58)","v":0},0]
[null,"       2.3. NRO. EX/SEROLOGIA",null,{"$f":"+GETPIVOTDATA(\" BAS034\",TD!$A$58)","v":175},{"$f":"IFERROR(D23/D20,0)","v":0.2936241610738255},"5. NRO. DE MUESTRA P/ CONTROL DE TTO.",null,null,null,{"$f":"SUM(J24:J26)","v":0},null,null,null,"       2.3. NRO. EX/SEROLOGIA",null,null,null,null,null,{"$f":"+GETPIVOTDATA(\" BAS029\",TD!$A$58)","v":15},{"$f":"+GETPIVOTDATA(\" BAS030\",TD!$A$58)","v":6},{"$f":"+GETPIVOTDATA(\" BAS031\",TD!$A$58)","v":25},{"$f":"+GETPIVOTDATA(\" BAS032\",TD!$A$58)","v":88},{"$f":"+GETPIVOTDATA(\" BAS033\",TD!$A$58)","v":41},175]
[null,"       2.4. NRO. EX/CULTIVO",null,{"$f":"+GETPIVOTDATA(\" BAS040\",TD!$A$58)","v":1},{"$f":"IFERROR(D24/D20,0)","v":1.6778523489932886E-3},"    5.1.          FROTIS",null,null,null,0,null,null,null,"       2.4. NRO. EX/CULTIVO",null,null,null,null,null,{"$f":"+GETPIVOTDATA(\" BAS035\",TD!$A$58)","v":0},{"$f":"+GETPIVOTDATA(\" BAS036\",TD!$A$58)","v":0},{"$f":"+GETPIVOTDATA(\" BAS037\",TD!$A$58)","v":0},{"$f":"+GETPIVOTDATA(\" BAS038\",TD!$A$58)","v":1},{"$f":"+GETPIVOTDATA(\" BAS039\",TD!$A$58)","v":0},1]
[null,"   3. NRO. DE PERSONAS EXAMINADAS R+",null,{"$f":"SUM(D26:D28)","v":0},1,"                    CULTIVO",null,null,null,0,null,null,null,"   3. NRO. DE PERSONAS EXAMINADAS R+",null,null,null,null,null,{"$f":"SUM(T26:T28)","v":0},{"$f":"SUM(U26:U28)","v":0},{"$f":"SUM(V26:V28)","v":0},{"$f":"SUM(W26:W28)","v":0},{"$f":"SUM(X26:X28)","v":0},0]
[null,"       RESULTADOS +A     FROTIS",null,"-",null,"                    SEROLOGIA",null,null,null,"Total",null,null,null,"       RESULTADOS+    A     ",null,null,"FROTIS",null,null,null,null,null,null,null,0]
[null,"                                        CULTIVO",null,"-",null,null,null,null,null,null,null,null,null,null,null,null,"CULTIVO",null,null,null,null,null,null,null,{"$f":"SUM(T27:X27)","v":0}]
[null,"                                        SEROLOGIA",null,"-",null,null,null,null,null,null,null,null,null,null,null,null,"SEROLOGIA",null,null,null,null,null,null,null,{"$f":"SUM(T28:X28)","v":0}]
[]
[null,"II. INFORME DE CASOS :",null,null,null,null,null,null,null,null,null,null,null,"II. INFORME DE CASOS :"]
[null,null,null,null,"<1a","1-9a","10-14a","15-19a","20-59a","60a y +","TOTAL",null,null,null,null,null,null,null,null,"00-11a","12-17a","18-29a","30-59a","60-99a","TOTAL"]
[null,"A. LEISHMANIASIS TOTAL",null,null,{"$f":"E33+E38+E43+E45+E49","v":0},12,7,5,39,14,{"$f":"SUM(E32:J32)","v":77},null,null,"A. LEISHMANIASIS TOTAL",null,null,null,null,null,{"$f":"T33+T38+T43+T45+T49","v":15},{"$f":"U33+U38+U43+U45+U49","v":5},{"$f":"V33+V38+V43+V45+V49","v":11},{"$f":"W33+W38+W43+W45+W49","v":32},{"$f":"X33+X38+X43+X45+X49","v":14},{"$f":"SUM(T32:X32)","v":77}]
[null,"     A.1. LEISHMANIASIS CUTANEA",null,null,{"$f":"SUM(E34:E37)","v":0},11,7,5,34,14,{"$f":"SUM(E33:J33)","v":71},null,null,"     A.1. LEISHMANIASIS CUTANEA",null,null,null,null,null,{"$f":"SUM(T34:T37)","v":14},{"$f":"SUM(U34:U37)","v":5},{"$f":"SUM(V34:V37)","v":10},{"$f":"SUM(W34:W37)","v":28},{"$f":"SUM(X34:X37)","v":14},{"$f":"SUM(T33:X33)","v":71}]
[null,"            1. CONF. FROTIS",null,null,{"$f":"+GETPIVOTDATA(\" BAS046\",TD!$A$58)","v":0},{"$f":"+GETPIVOTDATA(\" BAS047\",TD!$A$58)","v":7},{"$f":"+GETPIVOTDATA(\" BAS048\",TD!$A$58)","v":4},{"$f":"+GETPIVOTDATA(\" BAS049\",TD!$A$58)","v":5},{"$f":"+GETPIVOTDATA(\" BAS050\",TD!$A$58)","v":24},{"$f":"+GETPIVOTDATA(\" BAS045\",TD!$A$58)","v":10},{"$f":"SUM(E34:J34)","v":50},null,null,"            1. CONF. FROTIS",null,null,null,null,null,{"$f":"+GETPIVOTDATA(\" BAS041\",TD!$A$58)","v":9},{"$f":"+GETPIVOTDATA(\" BAS042\",TD!$A$58)","v":3},{"$f":"+GETPIVOTDATA(\" BAS043\",TD!$A$58)","v":9},{"$f":"+GETPIVOTDATA(\" BAS044\",TD!$A$58)","v":19},{"$f":"+GETPIVOTDATA(\" BAS045\",TD!$A$58)","v":10},{"$f":"SUM(T34:X34)","v":50}]
[null,"            2.CONF. BIOPSIA",null,null,{"$f":"+GETPIVOTDATA(\" BAS055\",TD!$A$58)","v":0},{"$f":"+GETPIVOTDATA(\" BAS056\",TD!$A$58)","v":0},{"$f":"+GETPIVOTDATA(\" BAS057\",TD!$A$58)","v":0},{"$f":"+GETPIVOTDATA(\" BAS058\",TD!$A$58)","v":0},{"$f":"+GETPIVOTDATA(\" BAS059\",TD!$A$58)","v":0},{"$f":"+GETPIVOTDATA(\" BAS054\",TD!$A$58)","v":0},0,null,null,"            2.CONF. BIOPSIA",null,null,null,null,null,{"$f":"+GETPIVOTDATA(\" BAS051\",TD!$A$58)","v":0},{"$f":"+GETPIVOTDATA(\" BAS052\",TD!$A$58)","v":0},{"$f":"+GETPIVOTDATA(\" BAS053\",TD!$A$58)","v":0},{"$f":"+GETPIVOTDATA(\" BAS054\",TD!$A$58)","v":0},{"$f":"+GETPIVOTDATA(\" BAS055\",TD!$A$58)","v":0},0]
[null,"            3.CONF. CULTIVO",null,null,{"$f":"+GETPIVOTDATA(\" BAS065\",TD!$A$58)","v":0},{"$f":"+GETPIVOTDATA(\" BAS066\",TD!$A$58)","v":0},{"$f":"+GETPIVOTDATA(\" BAS067\",TD!$A$58)","v":0},{"$f":"+GETPIVOTDATA(\" BAS068\",TD!$A$58)","v":0},{"$f":"+GETPIVOTDATA(\" BAS069\",TD!$A$58)","v":1},{"$f":"+GETPIVOTDATA(\" BAS064\",TD!$A$58)","v":0},1,null,null,"            3.CONF. CULTIVO",null,null,null,null,null,{"$f":"+GETPIVOTDATA(\" BAS060\",TD!$A$58)","v":0},{"$f":"+GETPIVOTDATA(\" BAS061\",TD!$A$58)","v":0},{"$f":"+GETPIVOTDATA(\" BAS062\",TD!$A$58)","v":0},{"$f":"+GETPIVOTDATA(\" BAS063\",TD!$A$58)","v":1},{"$f":"+GETPIVOTDATA(\" BAS064\",TD!$A$58)","v":0},1]
[null,"            4.CONF. SEROLOGIA",null,null,{"$f":"+GETPIVOTDATA(\" BAS075\",TD!$A$58)","v":0},{"$f":"+GETPIVOTDATA(\" BAS076\",TD!$A$58)","v":4},{"$f":"+GETPIVOTDATA(\" BAS077\",TD!$A$58)","v":3},{"$f":"+GETPIVOTDATA(\" BAS078\",TD!$A$58)","v":0},{"$f":"+GETPIVOTDATA(\" BAS079\",TD!$A$58)","v":9},{"$f":"+GETPIVOTDATA(\" BAS074\",TD!$A$58)","v":4},20,null,null,"            4.CONF. SEROLOGIA",null,null,null,null,null,{"$f":"+GETPIVOTDATA(\" BAS070\",TD!$A$58)","v":5},{"$f":"+GETPIVOTDATA(\" BAS071\",TD!$A$58)","v":2},{"$f":"+GETPIVOTDATA(\" BAS072\",TD!$A$58)","v":1},{"$f":"+GETPIVOTDATA(\" BAS073\",TD!$A$58)","v":8},{"$f":"+GETPIVOTDATA(\" BAS074\",TD!$A$58)","v":4},20]
[null,"     A.2. LEISHMANIASIS  MUCOCUTANEA",null,null,{"$f":"SUM(E39:E42)","v":0},0,0,0,5,0,5,null,null,"     A.2. LEISHMANIASIS  MUCOCUTANEA",null,null,null,null,null,{"$f":"SUM(T39:T42)","v":0},{"$f":"SUM(U39:U42)","v":0},{"$f":"SUM(V39:V42)","v":1},{"$f":"SUM(W39:W42)","v":4},{"$f":"SUM(X39:X42)","v":0},5]
[null,"            1. CONF. FROTIS",null,null,{"$f":"+GETPIVOTDATA(\" BAS085\",TD!$A$58)","v":0},{"$f":"+GETPIVOTDATA(\" BAS086\",TD!$A$58)","v":0},{"$f":"+GETPIVOTDATA(\" BAS087\",TD!$A$58)","v":0},{"$f":"+GETPIVOTDATA(\" BAS088\",TD!$A$58)","v":0},{"$f":"+GETPIVOTDATA(\" BAS089\",TD!$A$58)","v":1},{"$f":"+GETPIVOTDATA(\" BAS084\",TD!$A$58)","v":0},1,null,null,"            1. CONF. FROTIS",null,null,null,null,null,{"$f":"+GETPIVOTDATA(\" BAS080\",TD!$A$58)","v":0},{"$f":"+GETPIVOTDATA(\" BAS081\",TD!$A$58)","v":0},{"$f":"+GETPIVOTDATA(\" BAS082\",TD!$A$58)","v":0},{"$f":"+GETPIVOTDATA(\" BAS083\",TD!$A$58)","v":1},{"$f":"+GETPIVOTDATA(\" BAS084\",TD!$A$58)","v":0},1]
[null,"            2.CONF. BIOPSIA",null,null,{"$f":"+GETPIVOTDATA(\" BAS095\",TD!$A$58)","v":0},{"$f":"+GETPIVOTDATA(\" BAS096\",TD!$A$58)","v":0},{"$f":"+GETPIVOTDATA(\" BAS097\",TD!$A$58)","v":0},{"$f":"+GETPIVOTDATA(\" BAS098\",TD!$A$58)","v":0},{"$f":"+GETPIVOTDATA(\" BAS099\",TD!$A$58)","v":0},{"$f":"+GETPIVOTDATA(\" BAS094\",TD!$A$58)","v":0},0,null,null,"            2.CONF. BIOPSIA",null,null,null,null,null,{"$f":"+GETPIVOTDATA(\" BAS090\",TD!$A$58)","v":0},{"$f":"+GETPIVOTDATA(\" BAS091\",TD!$A$58)","v":0},{"$f":"+GETPIVOTDATA(\" BAS092\",TD!$A$58)","v":0},{"$f":"+GETPIVOTDATA(\" BAS093\",TD!$A$58)","v":0},{"$f":"+GETPIVOTDATA(\" BAS094\",TD!$A$58)","v":0},0]
[null,"            3.CONF. CULTIVO",null,null,{"$f":"+GETPIVOTDATA(\" BAS105\",TD!$A$58)","v":0},{"$f":"+GETPIVOTDATA(\" BAS106\",TD!$A$58)","v":0},{"$f":"+GETPIVOTDATA(\" BAS107\",TD!$A$58)","v":0},{"$f":"+GETPIVOTDATA(\" BAS108\",TD!$A$58)","v":0},{"$f":"+GETPIVOTDATA(\" BAS109\",TD!$A$58)","v":0},{"$f":"+GETPIVOTDATA(\" BAS104\",TD!$A$58)","v":0},0,null,null,"            3.CONF. CULTIVO",null,null,null,null,null,{"$f":"+GETPIVOTDATA(\" BAS100\",TD!$A$58)","v":0},{"$f":"+GETPIVOTDATA(\" BAS101\",TD!$A$58)","v":0},{"$f":"+GETPIVOTDATA(\" BAS102\",TD!$A$58)","v":0},{"$f":"+GETPIVOTDATA(\" BAS103\",TD!$A$58)","v":0},{"$f":"+GETPIVOTDATA(\" BAS104\",TD!$A$58)","v":0},0]
[null,"            4.CONF. SEROLOGIA",null,null,{"$f":"+GETPIVOTDATA(\" BAS115\",TD!$A$58)","v":0},{"$f":"+GETPIVOTDATA(\" BAS116\",TD!$A$58)","v":0},{"$f":"+GETPIVOTDATA(\" BAS117\",TD!$A$58)","v":0},{"$f":"+GETPIVOTDATA(\" BAS118\",TD!$A$58)","v":0},{"$f":"+GETPIVOTDATA(\" BAS119\",TD!$A$58)","v":4},{"$f":"+GETPIVOTDATA(\" BAS114\",TD!$A$58)","v":0},4,null,null,"            4.CONF. SEROLOGIA",null,null,null,null,null,{"$f":"+GETPIVOTDATA(\" BAS110\",TD!$A$58)","v":0},{"$f":"+GETPIVOTDATA(\" BAS111\",TD!$A$58)","v":0},{"$f":"+GETPIVOTDATA(\" BAS112\",TD!$A$58)","v":1},{"$f":"+GETPIVOTDATA(\" BAS113\",TD!$A$58)","v":3},{"$f":"+GETPIVOTDATA(\" BAS114\",TD!$A$58)","v":0},4]
[null,"     A.3. LEISHMANIASIS VISCERAL",null,null,{"$f":"E44","v":0},0,0,0,0,0,0,null,null,"     A.3. LEISHMANIASIS VISCERAL",null,null,null,null,null,{"$f":"T44","v":0},{"$f":"U44","v":0},{"$f":"V44","v":0},{"$f":"W44","v":0},{"$f":"X44","v":0},0]
[null,"             LEISH. VISCERAL CONF.SEROLOGIA",null,null,{"$f":"+GETPIVOTDATA(\" BAS125\",TD!$A$58)","v":0},{"$f":"+GETPIVOTDATA(\" BAS126\",TD!$A$58)","v":0},{"$f":"+GETPIVOTDATA(\" BAS127\",TD!$A$58)","v":0},{"$f":"+GETPIVOTDATA(\" BAS128\",TD!$A$58)","v":0},{"$f":"+GETPIVOTDATA(\" BAS129\",TD!$A$58)","v":0},{"$f":"+GETPIVOTDATA(\" BAS124\",TD!$A$58)","v":0},0,null,null,"             LEISH. VISCERAL CONF.SEROLOGIA",null,null,null,null,null,{"$f":"+GETPIVOTDATA(\" BAS120\",TD!$A$58)","v":0},{"$f":"+GETPIVOTDATA(\" BAS121\",TD!$A$58)","v":0},{"$f":"+GETPIVOTDATA(\" BAS122\",TD!$A$58)","v":0},{"$f":"+GETPIVOTDATA(\" BAS123\",TD!$A$58)","v":0},{"$f":"+GETPIVOTDATA(\" BAS124\",TD!$A$58)","v":0},0]
[null,"     A.4. LEISHMANIASIS SIN CONFIRMACION PARASITOLOGICA",null,null,{"$f":"SUM(E46:E48)","v":0},0,0,0,0,0,{"$f":"SUM(E45:J45)","v":0},null,null,"     A.4. LEISHMANIASIS SIN CONFIRMACION PARASITOLOGICA",null,null,null,null,null,{"$f":"SUM(T46:T48)","v":0},{"$f":"SUM(U46:U48)","v":0},{"$f":"SUM(V46:V48)","v":0},{"$f":"SUM(W46:W48)","v":0},{"$f":"SUM(X46:X48)","v":0},0]
[null,"           1. LEISHMANINA",null,null,{"$f":"+GETPIVOTDATA(\" BAS135\",TD!$A$58)","v":0},{"$f":"+GETPIVOTDATA(\" BAS136\",TD!$A$58)","v":0},{"$f":"+GETPIVOTDATA(\" BAS137\",TD!$A$58)","v":0},{"$f":"+GETPIVOTDATA(\" BAS138\",TD!$A$58)","v":0},{"$f":"+GETPIVOTDATA(\" BAS139\",TD!$A$58)","v":0},{"$f":"+GETPIVOTDATA(\" BAS134\",TD!$A$58)","v":0},{"$f":"SUM(E46:J46)","v":0},null,null,"           1. LEISHMANINA",null,null,null,null,null,{"$f":"+GETPIVOTDATA(\" BAS130\",TD!$A$58)","v":0},{"$f":"+GETPIVOTDATA(\" BAS131\",TD!$A$58)","v":0},{"$f":"+GETPIVOTDATA(\" BAS132\",TD!$A$58)","v":0},{"$f":"+GETPIVOTDATA(\" BAS133\",TD!$A$58)","v":0},{"$f":"+GETPIVOTDATA(\" BAS134\",TD!$A$58)","v":0},0]
[null,"           2. SIN EXAMEN DE LABORATORIO",null,null,{"$f":"+GETPIVOTDATA(\" BAS145\",TD!$A$58)","v":0},{"$f":"+GETPIVOTDATA(\" BAS146\",TD!$A$58)","v":0},{"$f":"+GETPIVOTDATA(\" BAS147\",TD!$A$58)","v":0},{"$f":"+GETPIVOTDATA(\" BAS148\",TD!$A$58)","v":0},{"$f":"+GETPIVOTDATA(\" BAS149\",TD!$A$58)","v":0},{"$f":"+GETPIVOTDATA(\" BAS144\",TD!$A$58)","v":0},0,null,null,"           2. SIN EXAMEN DE LABORATORIO",null,null,null,null,null,{"$f":"+GETPIVOTDATA(\" BAS140\",TD!$A$58)","v":0},{"$f":"+GETPIVOTDATA(\" BAS141\",TD!$A$58)","v":0},{"$f":"+GETPIVOTDATA(\" BAS142\",TD!$A$58)","v":0},{"$f":"+GETPIVOTDATA(\" BAS143\",TD!$A$58)","v":0},{"$f":"+GETPIVOTDATA(\" BAS144\",TD!$A$58)","v":0},0]
[null,"           3. CON RESULTADO DE LABORATORIO (-)",null,null,{"$f":"+GETPIVOTDATA(\" BAS155\",TD!$A$58)","v":0},{"$f":"+GETPIVOTDATA(\" BAS156\",TD!$A$58)","v":0},{"$f":"+GETPIVOTDATA(\" BAS157\",TD!$A$58)","v":0},{"$f":"+GETPIVOTDATA(\" BAS158\",TD!$A$58)","v":0},{"$f":"+GETPIVOTDATA(\" BAS159\",TD!$A$58)","v":0},{"$f":"+GETPIVOTDATA(\" BAS154\",TD!$A$58)","v":0},0,null,null,"           3. CON RESULTADO DE LABORATORIO (-)",null,null,null,null,null,{"$f":"+GETPIVOTDATA(\" BAS150\",TD!$A$58)","v":0},{"$f":"+GETPIVOTDATA(\" BAS151\",TD!$A$58)","v":0},{"$f":"+GETPIVOTDATA(\" BAS152\",TD!$A$58)","v":0},{"$f":"+GETPIVOTDATA(\" BAS153\",TD!$A$58)","v":0},{"$f":"+GETPIVOTDATA(\" BAS154\",TD!$A$58)","v":0},0]
[null,"     A.5. LEISHMANIASIS PARA ANFOTERECIN \"B\" (*)",null,null,{"$f":"SUM(E50:E51)","v":0},1,0,0,0,0,1,null,null,"     A.5. LEISHMANIASIS PARA ANFOTERECIN \"B\" (*)",null,null,null,null,null,{"$f":"SUM(T50:T51)","v":1},{"$f":"SUM(U50:U51)","v":0},{"$f":"SUM(V50:V51)","v":0},{"$f":"SUM(W50:W51)","v":0},{"$f":"SUM(X50:X51)","v":0},1]
[null,"          1. LEISHMANIASIS CUTANEA",null,null,{"$f":"+GETPIVOTDATA(\" BAS165\",TD!$A$58)","v":0},{"$f":"+GETPIVOTDATA(\" BAS166\",TD!$A$58)","v":1},{"$f":"+GETPIVOTDATA(\" BAS167\",TD!$A$58)","v":0},{"$f":"+GETPIVOTDATA(\" BAS168\",TD!$A$58)","v":0},{"$f":"+GETPIVOTDATA(\" BAS169\",TD!$A$58)","v":0},{"$f":"+GETPIVOTDATA(\" BAS164\",TD!$A$58)","v":0},1,null,null,"          1. LEISHMANIASIS CUTANEA",null,null,null,null,null,{"$f":"+GETPIVOTDATA(\" BAS160\",TD!$A$58)","v":1},{"$f":"+GETPIVOTDATA(\" BAS161\",TD!$A$58)","v":0},{"$f":"+GETPIVOTDATA(\" BAS162\",TD!$A$58)","v":0},{"$f":"+GETPIVOTDATA(\" BAS163\",TD!$A$58)","v":0},{"$f":"+GETPIVOTDATA(\" BAS164\",TD!$A$58)","v":0},1]
[null,"          2. LEISHMANIASIS MUCOSO",null,null,{"$f":"+GETPIVOTDATA(\" BAS175\",TD!$A$58)","v":0},{"$f":"+GETPIVOTDATA(\" BAS176\",TD!$A$58)","v":0},{"$f":"+GETPIVOTDATA(\" BAS177\",TD!$A$58)","v":0},{"$f":"+GETPIVOTDATA(\" BAS178\",TD!$A$58)","v":0},{"$f":"+GETPIVOTDATA(\" BAS179\",TD!$A$58)","v":0},{"$f":"+GETPIVOTDATA(\" BAS174\",TD!$A$58)","v":0},0,null,null,"          2. LEISHMANIASIS MUCOSO",null,null,null,null,null,{"$f":"+GETPIVOTDATA(\" BAS170\",TD!$A$58)","v":0},{"$f":"+GETPIVOTDATA(\" BAS171\",TD!$A$58)","v":0},{"$f":"+GETPIVOTDATA(\" BAS172\",TD!$A$58)","v":0},{"$f":"+GETPIVOTDATA(\" BAS173\",TD!$A$58)","v":0},{"$f":"+GETPIVOTDATA(\" BAS174\",TD!$A$58)","v":0},0]
[]
[null,"III. FALLECIDOS ",null,null,{"$f":"+GETPIVOTDATA(\" BAS185\",TD!$A$58)","v":0},{"$f":"+GETPIVOTDATA(\" BAS186\",TD!$A$58)","v":0},{"$f":"+GETPIVOTDATA(\" BAS187\",TD!$A$58)","v":0},{"$f":"+GETPIVOTDATA(\" BAS188\",TD!$A$58)","v":0},{"$f":"+GETPIVOTDATA(\" BAS189\",TD!$A$58)","v":0},{"$f":"+GETPIVOTDATA(\" BAS184\",TD!$A$58)","v":0},0,null,null,"III. FALLECIDOS ",null,null,null,null,null,{"$f":"+GETPIVOTDATA(\" BAS180\",TD!$A$58)","v":0},{"$f":"+GETPIVOTDATA(\" BAS181\",TD!$A$58)","v":0},{"$f":"+GETPIVOTDATA(\" BAS182\",TD!$A$58)","v":0},{"$f":"+GETPIVOTDATA(\" BAS183\",TD!$A$58)","v":0},{"$f":"+GETPIVOTDATA(\" BAS184\",TD!$A$58)","v":0},{"$f":"SUM(T53:X53)","v":0}]
[null,null,null,null,{"$f":"+GETPIVOTDATA(\" BAS195\",TD!$A$58)","v":0},{"$f":"+GETPIVOTDATA(\" BAS196\",TD!$A$58)","v":0},{"$f":"+GETPIVOTDATA(\" BAS197\",TD!$A$58)","v":1},{"$f":"+GETPIVOTDATA(\" BAS198\",TD!$A$58)","v":1},{"$f":"+GETPIVOTDATA(\" BAS199\",TD!$A$58)","v":1},{"$f":"+GETPIVOTDATA(\" BAS194\",TD!$A$58)","v":0}]
[null,"IV. RAM                                                              Nº",null,{"$f":"SUM(E54:J54)","v":3},"            %",{"$f":"D55/K32","v":3.896103896103896E-2},null,null,null,null,null,null,null,"IV. RAM",null,null,null,null,null,{"$f":"+GETPIVOTDATA(\" BAS190\",TD!$A$58)","v":1},{"$f":"+GETPIVOTDATA(\" BAS191\",TD!$A$58)","v":1},{"$f":"+GETPIVOTDATA(\" BAS192\",TD!$A$58)","v":1},{"$f":"+GETPIVOTDATA(\" BAS193\",TD!$A$58)","v":0},{"$f":"+GETPIVOTDATA(\" BAS194\",TD!$A$58)","v":0},{"$f":"SUM(T55:X55)","v":3}]
[]
[null,"V. NRO. DE TRATAMIENTO UTILIZADOS    : ",null,{"$f":"SUM(E58:J58)+SUM(E59:J59)","v":99},null,null,null,null,null,null,null,null,null,"V. NRO. DE TRATAMIENTO UTILIZADOS    : ",null,null,null,null,null,{"$f":"SUM(T62:T63)","v":29},{"$f":"SUM(U62:U63)","v":3},{"$f":"SUM(V62:V63)","v":15},{"$f":"SUM(W62:W63)","v":36},{"$f":"SUM(X62:X63)","v":14},{"$f":"SUM(T57:X57)","v":97}]
[null,"       NRO. DE AMPOLLAS X TRATAMIENTO: ",null,{"$f":"+K58+K59","v":2090},{"$f":"+GETPIVOTDATA(\" BAS205\",TD!$A$58)","v":0},{"$f":"+GETPIVOTDATA(\" BAS206\",TD!$A$58)","v":14},{"$f":"+GETPIVOTDATA(\" BAS207\",TD!$A$58)","v":14},{"$f":"+GETPIVOTDATA(\" BAS208\",TD!$A$58)","v":8},{"$f":"+GETPIVOTDATA(\" BAS209\",TD!$A$58)","v":39},{"$f":"+GETPIVOTDATA(\" BAS204\",TD!$A$58)","v":13},{"$f":"SUM(E58:J58)*20","v":1760},null,null,"       NRO. DE AMPOLLAS X TRATAMIENTO: ",null,null,null,null,null,{"$f":"+T62*20+T63*30","v":590},{"$f":"+U62*20+U63*30","v":60},{"$f":"+V62*20+V63*30","v":320},{"$f":"+W62*20+W63*30","v":790},{"$f":"+X62*20+X63*30","v":290},{"$f":"SUM(T58:X58)","v":2050}]
[null,"       ABANDONOS                                        :",null,0,{"$f":"+GETPIVOTDATA(\" BAS215\",TD!$A$58)","v":0},{"$f":"+GETPIVOTDATA(\" BAS216\",TD!$A$58)","v":0},{"$f":"+GETPIVOTDATA(\" BAS217\",TD!$A$58)","v":1},{"$f":"+GETPIVOTDATA(\" BAS218\",TD!$A$58)","v":0},{"$f":"+GETPIVOTDATA(\" BAS219\",TD!$A$58)","v":9},{"$f":"+GETPIVOTDATA(\" BAS214\",TD!$A$58)","v":1},{"$f":"SUM(E59:J59)*30","v":330},null,null,"       ABANDONOS                                        :",null,null,null,null,null,null,null,null,null,null,{"$f":"SUM(T59:X59)","v":0}]
[]
[]
[null,"VI. ACTIVIDADES DE CONTROL VECTORIAL",null,null,null,"SALDO DE MEDICAMENTOS .",null,null,null,null,null,null,null,null,null,null,null,null,null,{"$f":"+GETPIVOTDATA(\" BAS200\",TD!$A$58)","v":28},{"$f":"+GETPIVOTDATA(\" BAS201\",TD!$A$58)","v":3},{"$f":"+GETPIVOTDATA(\" BAS202\",TD!$A$58)","v":13},{"$f":"+GETPIVOTDATA(\" BAS203\",TD!$A$58)","v":29},{"$f":"+GETPIVOTDATA(\" BAS204\",TD!$A$58)","v":13}]
[null,"     6.1. SANEAMIETO",null,null,null,"_Amp. X 1.5 grs. A.M  ",null,0,null,null,null,null,null,null,null,null,null,null,null,{"$f":"+GETPIVOTDATA(\" BAS210\",TD!$A$58)","v":1},{"$f":"+GETPIVOTDATA(\" BAS211\",TD!$A$58)","v":0},{"$f":"+GETPIVOTDATA(\" BAS212\",TD!$A$58)","v":2},{"$f":"+GETPIVOTDATA(\" BAS213\",TD!$A$58)","v":7},{"$f":"+GETPIVOTDATA(\" BAS214\",TD!$A$58)","v":1}]
[null,"     6.2. RESIDUALES",null,null,null,"_Amp. X 1.5 grs. SNa ",null,0]
[null,"     6.3. U.L.V.",null,null,null,"_Amp. X 30 mgs. Aph. ",null,0]
[]
[null,"VII. SALDO DE INSECTICIDA :"]
[null,"      ESPECIFICAR PRODUCTO :             -"]
[]
[]
[]
[]
[null,"Lugar y Fecha",null,null,null,null,"Firma y Sello del Coordinador del PCMOEM"]

{"sheet":"OTROS","index":6,"n_rows":46,"n_cols":25,"rows_kept":46,"cut":false,"hidden":false,"merged":[[10,5,10,11],[10,15,10,20],[0,1,0,31],[1,1,1,31],[2,1,2,31],[3,1,3,31],[4,1,4,31],[6,5,6,11],[6,15,6,20],[6,22,6,23],[6,24,6,26],[7,26,7,27],[8,5,8,11],[8,15,8,20],[8,22,8,23],[8,24,8,26],[25,2,25,3],[25,13,25,14],[14,9,14,10],[15,2,15,3],[15,13,15,14],[16,13,16,14],[17,13,17,14],[18,13,18,14],[19,2,19,3],[19,13,19,14],[21,2,21,3],[24,9,24,10],[24,13,24,14],[42,13,42,14],[26,13,26,14],[29,2,29,3],[35,13,35,14],[36,13,36,14],[37,2,37,3],[41,2,41,3],[41,13,41,14]]}
[null,"DIRECCION REGIONAL DE SALUD CUSCO"]
[null,"DIRECCION EJECUTIVA DE INTELIGENCIA SANITARIA"]
[null,"DIRECCION DE ESTADISTICA Y TELECOMUNICACIONES"]
[null,"METAXENICAS OTROS"]
[null,"INFORME OPERACIONAL MENSUAL"]
[]
[null,null,"RED DE SALUD",null,null,{"$f":"TD!F3","v":"LA CONVENCION"},null,null,null,null,null,null,null,"PROVINCIA",null,{"$f":"TD!F6","v":"(All)"},null,null,null,null,null,null,"AÑO :",null,{"$f":"TD!C10","v":"2024"}]
[]
[null,null,"MICRO RED",null,null,{"$f":"TD!F4","v":"(All)"},null,null,null,null,null,null,null,"DISTRITO",null,{"$f":"TD!F7","v":"(All)"},null,null,null,null,null,null,"MES :",null,{"$f":"TD!O17","v":"ENERO - NOVIEMBRE"}]
[]
[null,null,"ESTABLECIMIENTO",null,null,{"$f":"TD!F5","v":"(All)"}]
[]
[]
[]
[null,null,"I.  DENGUE :",null,null,null,null,null,null,null,null,null,null,"I.  DENGUE :"]
[null,null,"GRUPO ETAREO/CASOS",null,"<1a","1-9a","10-14a","15-19a","20-59a","60a y +","TOTAL",null,null,"GRUPO ETAREO/CASOS",null,"00-11a","12-17a","18-29a","30-59a","60-99a","TOTAL"]
[null,null,"CASOS CONFIRMADOS",null,{"$f":"GETPIVOTDATA(\" BAS116\",TD!$A$167)+GETPIVOTDATA(\" BAS126\",TD!$A$167)+GETPIVOTDATA(\" BAS136\",TD!$A$167)","v":2},{"$f":"+GETPIVOTDATA(\" BAS117\",TD!$A$167)+GETPIVOTDATA(\" BAS127\",TD!$A$167)+GETPIVOTDATA(\" BAS137\",TD!$A$167)","v":78},{"$f":"+GETPIVOTDATA(\" BAS118\",TD!$A$167)+(+GETPIVOTDATA(\" BAS128\",TD!$A$167))+(+GETPIVOTDATA(\" BAS138\",TD!$A$167))","v":73},{"$f":"+GETPIVOTDATA(\" BAS119\",TD!$A$167)+(+GETPIVOTDATA(\" BAS129\",TD!$A$167))+(+GETPIVOTDATA(\" BAS139\",TD!$A$167))","v":107},{"$f":"+GETPIVOTDATA(\" BAS120\",TD!$A$167)+(+GETPIVOTDATA(\" BAS130\",TD!$A$167))+(+GETPIVOTDATA(\" BAS140\",TD!$A$167))","v":889},{"$f":"+GETPIVOTDATA(\" BAS115\",TD!$A$167)+(+GETPIVOTDATA(\" BAS125\",TD!$A$167))+(+GETPIVOTDATA(\" BAS135\",TD!$A$167))","v":126},{"$f":"SUM(E17:J17)","v":1275},null,null,"CASOS CONFIRMADOS",null,{"$f":"SUM(P18:P20)","v":119},{"$f":"SUM(Q18:Q20)","v":111},{"$f":"SUM(R18:R20)","v":342},{"$f":"SUM(S18:S20)","v":594},{"$f":"SUM(T18:T20)","v":126},{"$f":"SUM(P17:T17)","v":1292}]
[null,null,"CASOS PROBABLES",null,{"$f":"+GETPIVOTDATA(\" BAS106\",TD!$A$167)","v":25},{"$f":"+GETPIVOTDATA(\" BAS107\",TD!$A$167)","v":533},{"$f":"+GETPIVOTDATA(\" BAS108\",TD!$A$167)","v":547},{"$f":"+GETPIVOTDATA(\" BAS109\",TD!$A$167)","v":647},{"$f":"+GETPIVOTDATA(\" BAS110\",TD!$A$167)","v":3611},{"$f":"+GETPIVOTDATA(\" BAS105\",TD!$A$167)","v":717},{"$f":"SUM(E18:J18)","v":6080},null,null,"Dengue sin signos de alarma",null,{"$f":"+GETPIVOTDATA(\" BAS111\",TD!$A$167)","v":119},{"$f":"+GETPIVOTDATA(\" BAS112\",TD!$A$167)","v":111},{"$f":"+GETPIVOTDATA(\" BAS113\",TD!$A$167)","v":341},{"$f":"+GETPIVOTDATA(\" BAS114\",TD!$A$167)","v":593},{"$f":"+GETPIVOTDATA(\" BAS115\",TD!$A$167)","v":126},{"$f":"SUM(P18:T18)","v":1290}]
[null,null,"DEFUNCIONES",null,{"$f":"+GETPIVOTDATA(\" BAS146\",TD!$A$167)","v":0},{"$f":"+GETPIVOTDATA(\" BAS147\",TD!$A$167)","v":0},{"$f":"+GETPIVOTDATA(\" BAS148\",TD!$A$167)","v":0},{"$f":"+GETPIVOTDATA(\" BAS149\",TD!$A$167)","v":0},{"$f":"+GETPIVOTDATA(\" BAS150\",TD!$A$167)","v":0},{"$f":"+GETPIVOTDATA(\" BAS145\",TD!$A$167)","v":0},{"$f":"SUM(E19:J19)","v":0},null,null,"Dengue con signos de alarma",null,{"$f":"+GETPIVOTDATA(\" BAS121\",TD!$A$167)","v":0},{"$f":"+GETPIVOTDATA(\" BAS122\",TD!$A$167)","v":0},{"$f":"+GETPIVOTDATA(\" BAS123\",TD!$A$167)","v":1},{"$f":"+GETPIVOTDATA(\" BAS124\",TD!$A$167)","v":1},{"$f":"+GETPIVOTDATA(\" BAS125\",TD!$A$167)","v":0},{"$f":"SUM(P19:T19)","v":2}]
[null,null,"TOTAL DE CASOS",null,{"$f":"SUM(E17:E18)","v":27},611,620,754,4500,843,{"$f":"SUM(E20:J20)","v":7355},null,null,"Dengue Grave",null,{"$f":"+GETPIVOTDATA(\" BAS131\",TD!$A$167)","v":0},{"$f":"+GETPIVOTDATA(\" BAS132\",TD!$A$167)","v":0},{"$f":"+GETPIVOTDATA(\" BAS133\",TD!$A$167)","v":0},{"$f":"+GETPIVOTDATA(\" BAS134\",TD!$A$167)","v":0},{"$f":"+GETPIVOTDATA(\" BAS135\",TD!$A$167)","v":0},{"$f":"SUM(P20:T20)","v":0}]
[]
[null,null,"SEROTIPOS PRESENTADOS:",null,"I","II","III",null,"       CASOS AUTOCTONOS",null,0,null,null,"CASOS PROBABLES",null,{"$f":"+GETPIVOTDATA(\" BAS101\",TD!$A$167)","v":775},{"$f":"+GETPIVOTDATA(\" BAS102\",TD!$A$167)","v":670},{"$f":"+GETPIVOTDATA(\" BAS103\",TD!$A$167)","v":1511},{"$f":"+GETPIVOTDATA(\" BAS104\",TD!$A$167)","v":2407},{"$f":"+GETPIVOTDATA(\" BAS105\",TD!$A$167)","v":717},{"$f":"SUM(P22:T22)","v":6080}]
[null,null,null,null,null,null,null,null,"         CASOS IMPORTADOS",null,0,null,null,"DEFUNCIONES",null,{"$f":"+GETPIVOTDATA(\" BAS141\",TD!$A$167)","v":0},{"$f":"+GETPIVOTDATA(\" BAS142\",TD!$A$167)","v":0},{"$f":"+GETPIVOTDATA(\" BAS143\",TD!$A$167)","v":0},{"$f":"+GETPIVOTDATA(\" BAS144\",TD!$A$167)","v":0},{"$f":"+GETPIVOTDATA(\" BAS145\",TD!$A$167)","v":0},{"$f":"SUM(P23:T23)","v":0}]
[]
[null,null,"II.  FIEBRE AMARILLA:",null,null,null,null,null,null,0,null,null,null,"TOTAL DE CASOS",null,{"$f":"+P22+P17","v":894},{"$f":"+Q22+Q17","v":781},{"$f":"+R22+R17","v":1853},{"$f":"+S22+S17","v":3001},{"$f":"+T22+T17","v":843},{"$f":"SUM(P25:T25)","v":7372}]
[null,null,"GRUPO ETAREO/CASOS",null,"<1a","1-9a","10-14a","15-19a","20-59a","60a y +","TOTAL",null,null,"TRATAMIENTOS",null,{"$f":"+GETPIVOTDATA(\" BAS151\",TD!$A$167)+(+GETPIVOTDATA(\" BAS161\",TD!$A$167))+(+GETPIVOTDATA(\" BAS171\",TD!$A$167))","v":208},{"$f":"+GETPIVOTDATA(\" BAS152\",TD!$A$167)+(+GETPIVOTDATA(\" BAS162\",TD!$A$167))+(+GETPIVOTDATA(\" BAS172\",TD!$A$167))","v":60},{"$f":"+GETPIVOTDATA(\" BAS153\",TD!$A$167)+(+GETPIVOTDATA(\" BAS163\",TD!$A$167))+(+GETPIVOTDATA(\" BAS173\",TD!$A$167))","v":291},{"$f":"+GETPIVOTDATA(\" BAS154\",TD!$A$167)+(+GETPIVOTDATA(\" BAS164\",TD!$A$167))+(+GETPIVOTDATA(\" BAS174\",TD!$A$167))","v":466},{"$f":"+GETPIVOTDATA(\" BAS155\",TD!$A$167)+(+GETPIVOTDATA(\" BAS165\",TD!$A$167))+(+GETPIVOTDATA(\" BAS175\",TD!$A$167))","v":91},{"$f":"SUM(P26:T26)","v":1116}]
[null,null,"CASOS CONFIRMADOS",null,{"$f":"+GETPIVOTDATA(\" BAS026\",TD!$A$167)","v":0},{"$f":"+GETPIVOTDATA(\" BAS027\",TD!$A$167)","v":0},{"$f":"+GETPIVOTDATA(\" BAS028\",TD!$A$167)","v":0},{"$f":"+GETPIVOTDATA(\" BAS029\",TD!$A$167)","v":0},{"$f":"+GETPIVOTDATA(\" BAS030\",TD!$A$167)","v":0},{"$f":"+GETPIVOTDATA(\" BAS025\",TD!$A$167)","v":0},{"$f":"SUM(E27:J27)","v":0},null,null,"NEXO EPIDEMIOLOGICO",null,{"$f":"+GETPIVOTDATA(\" BAS181\",TD!$A$167)","v":6},{"$f":"+GETPIVOTDATA(\" BAS182\",TD!$A$167)","v":0},{"$f":"+GETPIVOTDATA(\" BAS183\",TD!$A$167)","v":32},{"$f":"+GETPIVOTDATA(\" BAS184\",TD!$A$167)","v":39},{"$f":"+GETPIVOTDATA(\" BAS185\",TD!$A$167)","v":2},{"$f":"SUM(P27:T27)","v":79}]
[null,null,"CASOS PROBABLES",null,{"$f":"+GETPIVOTDATA(\" BAS016\",TD!$A$167)","v":0},{"$f":"+GETPIVOTDATA(\" BAS017\",TD!$A$167)","v":0},{"$f":"+GETPIVOTDATA(\" BAS018\",TD!$A$167)","v":0},{"$f":"+GETPIVOTDATA(\" BAS019\",TD!$A$167)","v":0},{"$f":"+GETPIVOTDATA(\" BAS020\",TD!$A$167)","v":0},{"$f":"+GETPIVOTDATA(\" BAS015\",TD!$A$167)","v":0},{"$f":"SUM(E28:J28)","v":0}]
[null,null,"DEFUNCIONES",null,{"$f":"+GETPIVOTDATA(\" BAS036\",TD!$A$167)","v":0},{"$f":"+GETPIVOTDATA(\" BAS037\",TD!$A$167)","v":0},{"$f":"+GETPIVOTDATA(\" BAS038\",TD!$A$167)","v":0},{"$f":"+GETPIVOTDATA(\" BAS039\",TD!$A$167)","v":0},{"$f":"+GETPIVOTDATA(\" BAS040\",TD!$A$167)","v":0},{"$f":"+GETPIVOTDATA(\" BAS035\",TD!$A$167)","v":0},{"$f":"SUM(E29:J29)","v":0}]
[null,null,"TOTAL DE CASOS",null,{"$f":"SUM(E27:E28)","v":0},0,0,0,0,0,{"$f":"SUM(E30:J30)","v":0}]
[]
[null,null,"Nº CASOS CON VACUNACION:",null,0,"Nº CASOS SIN VACUNACION:",null,0,"CASOS AUTOCTONOS",null,0]
[null,null,"FIEBRE AMARILLA SELVATICA:",null,0,"FIEBRE AMARILLA URBANA:",null,0,"CASOS IMPORTADOS",null,0]
[]
[null,null,null,null,null,null,null,null,null,null,null,null,null,"II.  FIEBRE AMARILLA:"]
[null,null,null,null,null,null,null,null,null,null,null,null,null,"GRUPO ETAREO/CASOS",null,"00-11a","12-17a","18-29a","30-59a","60-99a","TOTAL"]
[null,null,"V.  ENFERMEDAD DE CHAGAS:",null,null,null,"                              POBLACION EN RIESGO:",null,null,null,null,null,null,"CASOS CONFIRMADOS",null,{"$f":"+GETPIVOTDATA(\" BAS021\",TD!$A$167)","v":0},{"$f":"+GETPIVOTDATA(\" BAS022\",TD!$A$167)","v":0},{"$f":"+GETPIVOTDATA(\" BAS023\",TD!$A$167)","v":0},{"$f":"+GETPIVOTDATA(\" BAS024\",TD!$A$167)","v":0},{"$f":"+GETPIVOTDATA(\" BAS025\",TD!$A$167)","v":0},{"$f":"SUM(P37:T37)","v":0}]
[null,null,"GRUPO ETAREO/CASOS",null,"<1a","1-9a","10-14a","15-19a","20-59a","60a y +","TOTAL",null,null,"CASOS PROBABLES",null,{"$f":"+GETPIVOTDATA(\" BAS011\",TD!$A$167)","v":0},{"$f":"+GETPIVOTDATA(\" BAS012\",TD!$A$167)","v":0},{"$f":"+GETPIVOTDATA(\" BAS013\",TD!$A$167)","v":0},{"$f":"+GETPIVOTDATA(\" BAS014\",TD!$A$167)","v":0},{"$f":"+GETPIVOTDATA(\" BAS015\",TD!$A$167)","v":0},{"$f":"SUM(P38:T38)","v":0}]
[null,null,"CASOS CONFIRMADOS",null,0,0,0,0,0,0,{"$f":"SUM(E39:J39)","v":0},null,null,"TOTAL DE CASOS",null,{"$f":"SUM(P37:P38)","v":0},{"$f":"SUM(Q37:Q38)","v":0},{"$f":"SUM(R37:R38)","v":0},{"$f":"SUM(S37:S38)","v":0},{"$f":"SUM(T37:T38)","v":0},{"$f":"SUM(P39:T39)","v":0}]
[null,null,"CASOS PROBABLES",null,0,0,0,0,0,0,{"$f":"SUM(E40:J40)","v":0},null,null,"DEFUNCIONES",null,{"$f":"+GETPIVOTDATA(\" BAS031\",TD!$A$167)","v":0},{"$f":"+GETPIVOTDATA(\" BAS032\",TD!$A$167)","v":0},{"$f":"+GETPIVOTDATA(\" BAS033\",TD!$A$167)","v":0},{"$f":"+GETPIVOTDATA(\" BAS034\",TD!$A$167)","v":0},{"$f":"+GETPIVOTDATA(\" BAS035\",TD!$A$167)","v":0},{"$f":"SUM(P40:T40)","v":0}]
[null,null,"DEFUNCIONES",null,0,0,0,0,0,0,{"$f":"SUM(E41:J41)","v":0}]
[null,null,"TOTAL DE CASOS",null,{"$f":"SUM(E39:E40)","v":0},0,0,0,0,0,{"$f":"SUM(E42:J42)","v":0},null,null,"TRATAMIENTOS",null,{"$f":"+GETPIVOTDATA(\" BAS041\",TD!$A$167)","v":0},{"$f":"+GETPIVOTDATA(\" BAS042\",TD!$A$167)","v":0},{"$f":"+GETPIVOTDATA(\" BAS043\",TD!$A$167)","v":0},{"$f":"+GETPIVOTDATA(\" BAS044\",TD!$A$167)","v":0},{"$f":"+GETPIVOTDATA(\" BAS045\",TD!$A$167)","v":0},{"$f":"SUM(P42:T42)","v":0}]
[null,null,null,null,null,null,null,null,null,null,null,null,null,"NEXO EPIDEMIOLOGICO",null,{"$f":"+GETPIVOTDATA(\" BAS051\",TD!$A$167)","v":0},{"$f":"+GETPIVOTDATA(\" BAS052\",TD!$A$167)","v":0},{"$f":"+GETPIVOTDATA(\" BAS053\",TD!$A$167)","v":0},{"$f":"+GETPIVOTDATA(\" BAS054\",TD!$A$167)","v":0},{"$f":"+GETPIVOTDATA(\" BAS055\",TD!$A$167)","v":0},{"$f":"SUM(P43:T43)","v":0}]
[null,null,"         CASOS AUTOCTONOS",null,0,null,null,null,"CASOS IMPORTADOS",null,0]
[null,null,"                           CASOS AGUDOS",null,0,null,null,null,"CASOS CRONICOS",null,0]
[null,null,null,null,null,null,null,null,"CASOS ASINTOMATICOS",null,0]